program: Orca
programVersion: 5.0.3
elementType: S O O O O O N N C C C C C C C C C C C C C C C C C C C C H H H H H H H H H H H H H H H H H H H H H H H H H H H H H H
charge: 0
multiplicity: 1
keywords: wb97x-d3
keywords: def2-TZVPP
keywords: def2/J RIJCOSX
keywords: DEFGRID2
keywords: scfconv7
keywords: smallprint printgap noloewdin
keywords: NOSOSCF
formula: C20H30N2O5S
InChI: InChI=1/C20H30N2O5S/c1-7-25-17(23)11-12-22(14(2)3)28-21(6)19(24)26-16-10-8-9-15-13-20(4,5)27-18(15)16/h8-10,14H,7,11-13H2,1-6H3
58 atoms
S  -2.730249 0.892468 1.414717
O  0.80668 -1.33919 -1.022546
O  -0.150266 -0.287465 1.454135
O  -0.787965 -2.442096 1.46625
O  1.645962 3.31861 -0.000665
O  1.18855 1.900049 -1.668116
N  -2.760875 1.435946 -0.15034
N  -2.345387 -0.791187 1.456068
C  1.570034 -2.082756 -2.028972
C  3.042997 -1.968254 -1.572513
C  2.913783 -1.51614 -0.150699
C  1.59075 -1.158716 0.051031
C  1.308695 -1.435012 -3.371214
C  1.080971 -3.518733 -1.986644
C  3.835953 -1.379241 0.869589
C  1.162136 -0.671435 1.272977
C  3.411935 -0.878597 2.098555
C  2.082027 -0.528933 2.300032
C  -3.894502 1.126079 -1.037339
C  -1.483173 1.579048 -0.845956
C  -5.231246 1.253436 -0.332517
C  -3.76571 -0.218235 -1.743683
C  -0.552144 2.54197 -0.132093
C  -1.07476 -1.265066 1.452796
C  0.837498 2.530507 -0.696771
C  -3.410225 -1.784918 1.52642
C  3.029483 3.409834 -0.381672
C  3.838527 2.257561 0.165391
H  3.565848 -2.920034 -1.673967
H  3.591276 -1.231558 -2.166325
H  1.614854 -0.388785 -3.373251
H  0.253236 -1.489682 -3.642143
H  1.877366 -1.950695 -4.144942
H  1.257217 -3.972026 -1.009119
H  1.609827 -4.11555 -2.73006
H  0.014081 -3.578323 -2.206304
H  4.872547 -1.650718 0.716442
H  4.118807 -0.762095 2.908568
H  1.753502 -0.144575 3.257324
H  -3.857357 1.907071 -1.803118
H  -1.004909 0.6101 -1.000174
H  -1.70437 1.969555 -1.840767
H  -5.322225 2.204228 0.192879
H  -6.028377 1.206683 -1.074913
H  -5.404278 0.449615 0.383325
H  -3.871969 -1.05181 -1.049321
H  -2.808866 -0.324604 -2.256069
H  -4.54861 -0.318652 -2.496518
H  -0.48497 2.313129 0.933129
H  -0.941436 3.561995 -0.19411
H  -3.309665 -2.402866 2.41834
H  -3.420456 -2.433968 0.651244
H  -4.364229 -1.270092 1.582493
H  3.119673 3.483957 -1.466017
H  3.367869 4.352643 0.044456
H  3.542071 1.302366 -0.266441
H  3.751561 2.19187 1.249924
H  4.890309 2.416294 -0.074541
elementType: S O N C H
totalener: -1664.19675520 hartree
nucrepener: 3216.80687699 hartree
electener: -4881.00363219 hartree
oneelecener: -8678.91283389 hartree
twoeener: 3797.90920170 hartree
cpcmener: -0.04365068 hartree
kineticenergy: 1657.93657898 hartree
xcener: -140.807899443904 hartree
chargesum: 0.0000000
charge: 0.013108 -0.362418 -0.319261 -0.513356 -0.300626 -0.498437 -0.129938 -0.155978 0.362595 -0.120697 -0.094224 0.304241 -0.315215 -0.326167 -0.167776 0.063068 -0.196742 -0.184100 0.063884 -0.126793 -0.272692 -0.293055 -0.114901 0.499282 0.435682 -0.202176 0.042796 -0.254830 0.103878 0.092884 0.096895 0.102378 0.110227 0.108402 0.103808 0.100006 0.147833 0.157451 0.149135 0.062363 0.081337 0.122045 0.096725 0.097828 0.086858 0.096041 0.097076 0.104502 0.099914 0.120522 0.127487 0.117505 0.114713 0.090861 0.110238 0.069513 0.091292 0.105006
qa: 0.0131 -0.3624 -0.3193 -0.5134 -0.3006 -0.4984 -0.1299 -0.1560 0.3626 -0.1207 -0.0942 0.3042 -0.3152 -0.3262 -0.1678 0.0631 -0.1967 -0.1841 0.0639 -0.1268 -0.2727 -0.2931 -0.1149 0.4993 0.4357 -0.2022 0.0428 -0.2548 0.1039 0.0929 0.0969 0.1024 0.1102 0.1084 0.1038 0.1000 0.1478 0.1575 0.1491 0.0624 0.0813 0.1220 0.0967 0.0978 0.0869 0.0960 0.0971 0.1045 0.0999 0.1205 0.1275 0.1175 0.1147 0.0909 0.1102 0.0695 0.0913 0.1050
va: 2.3622 2.0504 2.0755 1.9920 2.1299 1.9735 3.0688 3.1562 3.7143 4.0109 3.6322 3.8187 3.9418 3.9749 3.9003 3.7045 3.8552 3.9582 3.9063 3.9326 3.9153 3.8972 3.8288 4.2385 4.1141 3.8940 3.8587 3.9092 1.0036 1.0094 1.0099 1.0038 1.0039 0.9985 1.0056 1.0080 0.9981 0.9902 0.9976 1.0013 1.0080 1.0022 1.0117 1.0054 1.0039 0.9945 1.0042 1.0084 1.0466 1.0176 0.9991 0.9833 1.0001 1.0107 0.9960 1.0147 1.0040 1.0104
dispcorr: -0.037765112 hartree
energy: -1664.234520314169
dipole: -3.81045 4.02939 0.21894 -2.56550 3.45258 0.88708 -18.39716 17.29581 -1.10136
magnitude: 1.43102 au
magnitude: 3.63738 debye
