program: Orca
programVersion: 5.0.3
elementType: S O O O O O N N C C C C C C C C C C C C C C C C C C C C H H H H H H H H H H H H H H H H H H H H H H H H H H H H H H
charge: 0
multiplicity: 1
keywords: wb97x-d3
keywords: def2-TZVPP
keywords: def2/J RIJCOSX
keywords: DEFGRID2
keywords: scfconv7
keywords: smallprint printgap noloewdin
keywords: NOSOSCF
formula: C20H30N2O5S
InChI: InChI=1/C20H30N2O5S/c1-7-25-17(23)11-12-22(14(2)3)28-21(6)19(24)26-16-10-8-9-15-13-20(4,5)27-18(15)16/h8-10,14H,7,11-13H2,1-6H3
58 atoms
S  -1.659949 1.207467 1.328308
O  0.569029 -2.360227 -0.970036
O  0.3841 -0.754114 1.390947
O  -0.918807 -2.560542 1.695449
O  0.597547 4.150414 0.735922
O  -0.206333 4.19891 -1.349226
N  -1.676935 1.467117 -0.304891
N  -1.829918 -0.480314 1.635899
C  0.892045 -3.457603 -1.882012
C  2.402448 -3.70906 -1.670255
C  2.65308 -3.060232 -0.342546
C  1.536146 -2.296932 -0.042475
C  0.546678 -3.003691 -3.282617
C  0.062094 -4.655665 -1.451966
C  3.734466 -3.080945 0.517754
C  1.470255 -1.554457 1.123272
C  3.677093 -2.328684 1.689061
C  2.550774 -1.57305 1.991422
C  -2.930582 1.257081 -1.045664
C  -0.438073 1.305493 -1.060368
C  -2.958062 -0.077229 -1.784332
C  -3.214122 2.419928 -1.987003
C  0.694398 2.147124 -0.496096
C  -0.80128 -1.364311 1.577758
C  0.305954 3.600511 -0.433711
C  -3.162327 -1.032408 1.840793
C  0.305275 5.542808 0.939979
C  1.376289 6.444531 0.370789
H  2.635937 -4.774667 -1.681045
H  3.003114 -3.238594 -2.454519
H  -0.518925 -2.789513 -3.381795
H  0.794594 -3.787913 -3.998641
H  1.106512 -2.10927 -3.560186
H  -1.004482 -4.429257 -1.490364
H  0.307557 -4.971149 -0.435743
H  0.24906 -5.501083 -2.115216
H  4.613462 -3.669916 0.287832
H  4.51195 -2.334194 2.376997
H  2.506827 -0.993141 2.904984
H  -3.720687 1.246255 -0.291841
H  -0.119247 0.262157 -1.122416
H  -0.633052 1.623697 -2.084754
H  -2.244094 -0.099641 -2.610083
H  -2.730898 -0.915792 -1.124455
H  -3.948108 -0.249563 -2.208907
H  -2.483913 2.493008 -2.794716
H  -3.22661 3.368514 -1.45008
H  -4.192531 2.286888 -2.451056
H  1.554085 2.057885 -1.167075
H  1.016023 1.787701 0.479532
H  -3.532352 -1.551655 0.95474
H  -3.843592 -0.218188 2.072942
H  -3.171568 -1.726434 2.680725
H  -0.677515 5.785441 0.532915
H  0.251845 5.652736 2.022258
H  1.433423 6.387236 -0.715779
H  2.35713 6.20792 0.784438
H  1.146937 7.477601 0.635482
elementType: S O N C H
totalener: -1664.20685951 hartree
nucrepener: 3111.84088909 hartree
electener: -4776.04774860 hartree
oneelecener: -8467.88146143 hartree
twoeener: 3691.83371283 hartree
cpcmener: -0.03525283 hartree
kineticenergy: 1657.93015864 hartree
xcener: -140.799899313261 hartree
chargesum: -0.0000000
charge: 0.018251 -0.365191 -0.317198 -0.478324 -0.285746 -0.475051 -0.135996 -0.160559 0.357688 -0.124985 -0.097888 0.310613 -0.304265 -0.326566 -0.189510 0.083766 -0.148745 -0.212265 0.095033 -0.127848 -0.286780 -0.290553 -0.116606 0.470625 0.403358 -0.170711 0.039119 -0.253875 0.099775 0.090126 0.099527 0.105165 0.097051 0.099387 0.109315 0.102241 0.148804 0.155024 0.146302 0.060072 0.092015 0.125208 0.091229 0.085597 0.104955 0.085820 0.089518 0.098368 0.114220 0.090127 0.112877 0.101482 0.117378 0.089219 0.107399 0.088875 0.088353 0.094780
qa: 0.0183 -0.3652 -0.3172 -0.4783 -0.2857 -0.4751 -0.1360 -0.1606 0.3577 -0.1250 -0.0979 0.3106 -0.3043 -0.3266 -0.1895 0.0838 -0.1487 -0.2123 0.0950 -0.1278 -0.2868 -0.2906 -0.1166 0.4706 0.4034 -0.1707 0.0391 -0.2539 0.0998 0.0901 0.0995 0.1052 0.0971 0.0994 0.1093 0.1022 0.1488 0.1550 0.1463 0.0601 0.0920 0.1252 0.0912 0.0856 0.1050 0.0858 0.0895 0.0984 0.1142 0.0901 0.1129 0.1015 0.1174 0.0892 0.1074 0.0889 0.0884 0.0948
va: 2.3633 2.0699 2.0716 2.0342 2.1229 2.0143 2.9967 3.1654 3.7461 3.9977 3.6828 3.8699 3.9302 3.9750 3.9541 3.7728 3.8688 4.0114 3.8868 3.9206 3.9044 3.9270 3.8571 4.2819 4.1558 3.8836 3.8554 3.9196 1.0037 1.0077 1.0048 1.0045 1.0061 1.0081 0.9994 1.0065 0.9976 0.9898 1.0002 1.0075 1.0301 1.0038 0.9999 1.0120 1.0065 1.0077 1.0142 1.0070 1.0142 1.0454 0.9854 1.0118 1.0012 1.0111 0.9962 1.0134 1.0042 1.0071
dispcorr: -0.034208646 hartree
energy: -1664.241068156637
dipole: -8.02023 8.44920 0.42896 3.30361 -3.57095 -0.26735 -19.98836 18.97763 -1.01074
magnitude: 1.13008 au
magnitude: 2.87242 debye
