program: Orca
programVersion: 5.0.3
elementType: S O O O O O N N C C C C C C C C C C C C C C C C C C C C H H H H H H H H H H H H H H H H H H H H H H H H H H H H H H
charge: 0
multiplicity: 1
keywords: wb97x-d3
keywords: def2-TZVPP
keywords: def2/J RIJCOSX
keywords: DEFGRID2
keywords: scfconv7
keywords: smallprint printgap noloewdin
keywords: NOSOSCF
formula: C20H30N2O5S
InChI: InChI=1/C20H30N2O5S/c1-7-25-17(23)11-12-22(14(2)3)28-21(6)19(24)26-16-10-8-9-15-13-20(4,5)27-18(15)16/h8-10,14H,7,11-13H2,1-6H3
58 atoms
S  -1.577676 1.388255 1.279783
O  0.92056 -2.154692 -0.811117
O  0.357455 -0.655883 1.539024
O  -1.039289 -2.358537 1.979138
O  1.001367 3.74209 -0.289381
O  -0.00481 3.596668 -2.277641
N  -1.863847 1.537767 -0.344664
N  -1.846602 -0.249962 1.735858
C  1.635344 -2.833258 -1.893749
C  2.741425 -3.654926 -1.188865
C  2.775574 -3.051929 0.181976
C  1.673437 -2.219813 0.296076
C  2.226506 -1.757999 -2.788628
C  0.630777 -3.692805 -2.629262
C  3.636126 -3.217135 1.250202
C  1.415391 -1.534389 1.468519
C  3.378979 -2.531852 2.43582
C  2.271463 -1.700612 2.545952
C  -3.25585 1.614731 -0.821766
C  -0.884006 0.981293 -1.271225
C  -3.766099 0.302703 -1.4066
C  -3.419317 2.761491 -1.809945
C  0.500531 1.581507 -1.086527
C  -0.860398 -1.184725 1.757782
C  0.461183 3.070689 -1.29482
C  -3.1863 -0.708438 2.081175
C  1.010936 5.178284 -0.351919
C  -0.322433 5.774603 0.036385
H  2.485829 -4.717449 -1.143342
H  3.6939 -3.576312 -1.715473
H  2.76578 -2.215702 -3.619064
H  2.93277 -1.128324 -2.243619
H  1.44796 -1.119803 -3.209959
H  1.12398 -4.229177 -3.440713
H  -0.166555 -3.089395 -3.066263
H  0.180401 -4.432455 -1.965669
H  4.49866 -3.866775 1.16974
H  4.042229 -2.647846 3.282433
H  2.074925 -1.16587 3.46694
H  -3.855596 1.850892 0.059621
H  -0.819958 -0.107502 -1.190742
H  -1.223728 1.189839 -2.28592
H  -3.655285 -0.52775 -0.709039
H  -4.827213 0.389769 -1.645163
H  -3.248662 0.037691 -2.330541
H  -2.859545 2.59823 -2.732365
H  -3.093416 3.706147 -1.373681
H  -4.469937 2.866161 -2.085378
H  1.162227 1.151265 -1.843822
H  0.919845 1.33121 -0.114478
H  -3.562837 -1.443055 1.369013
H  -3.856668 0.146442 2.078548
H  -3.204322 -1.149254 3.07841
H  1.782485 5.475829 0.356772
H  1.323969 5.510982 -1.342821
H  -1.112457 5.521388 -0.669811
H  -0.232674 6.861614 0.054735
H  -0.628643 5.44989 1.031262
elementType: S O N C H
totalener: -1664.20702197 hartree
nucrepener: 3120.87712602 hartree
electener: -4785.08414799 hartree
oneelecener: -8485.72641382 hartree
twoeener: 3700.64226583 hartree
cpcmener: -0.03614388 hartree
kineticenergy: 1657.93457978 hartree
xcener: -140.800082222487 hartree
chargesum: -0.0000000
charge: 0.016633 -0.364151 -0.320578 -0.482813 -0.280592 -0.472589 -0.133545 -0.153552 0.367549 -0.126588 -0.113032 0.316582 -0.347654 -0.298346 -0.175613 0.064370 -0.162291 -0.188156 0.084239 -0.160157 -0.283807 -0.290039 -0.107334 0.479838 0.386415 -0.192175 0.041747 -0.255496 0.092626 0.098141 0.111000 0.112811 0.098945 0.101072 0.100319 0.098387 0.149089 0.155234 0.148546 0.060700 0.116397 0.125892 0.100901 0.100537 0.091149 0.085434 0.087432 0.099567 0.114236 0.088263 0.113556 0.106880 0.124408 0.107747 0.090054 0.084956 0.099669 0.087185
qa: 0.0166 -0.3642 -0.3206 -0.4828 -0.2806 -0.4726 -0.1335 -0.1536 0.3675 -0.1266 -0.1130 0.3166 -0.3477 -0.2983 -0.1756 0.0644 -0.1623 -0.1882 0.0842 -0.1602 -0.2838 -0.2900 -0.1073 0.4798 0.3864 -0.1922 0.0417 -0.2555 0.0926 0.0981 0.1110 0.1128 0.0989 0.1011 0.1003 0.0984 0.1491 0.1552 0.1485 0.0607 0.1164 0.1259 0.1009 0.1005 0.0911 0.0854 0.0874 0.0996 0.1142 0.0883 0.1136 0.1069 0.1244 0.1077 0.0901 0.0850 0.0997 0.0872
va: 2.3654 2.0793 2.0859 2.0315 2.1298 2.0192 2.9803 3.1664 3.6923 4.0162 3.7004 3.8868 3.9738 3.9533 3.9459 3.7573 3.8885 4.0109 3.8866 3.9202 3.8981 3.9310 3.8345 4.2640 4.2172 3.8953 3.8460 3.9169 1.0075 1.0039 1.0086 0.9942 1.0035 1.0026 1.0043 1.0055 0.9973 0.9899 0.9979 1.0093 1.0193 1.0019 1.0026 1.0064 1.0011 1.0082 1.0104 1.0084 1.0208 1.0523 0.9866 1.0054 0.9990 0.9972 1.0112 1.0123 1.0089 1.0048
dispcorr: -0.034796182 hartree
energy: -1664.241818155151
dipole: -10.43902 10.88164 0.44262 6.48137 -6.53223 -0.05086 -20.42878 19.47281 -0.95598
magnitude: 1.05470 au
magnitude: 2.68083 debye
