program: Orca
programVersion: 5.0.3
elementType: S O O O O O N N C C C C C C C C C C C C C C C C C C C C H H H H H H H H H H H H H H H H H H H H H H H H H H H H H H
charge: 0
multiplicity: 1
keywords: wb97x-d3
keywords: def2-TZVPP
keywords: def2/J RIJCOSX
keywords: DEFGRID2
keywords: scfconv7
keywords: smallprint printgap noloewdin
keywords: NOSOSCF
formula: C20H30N2O5S
InChI: InChI=1/C20H30N2O5S/c1-7-25-17(23)11-12-22(14(2)3)28-21(6)19(24)26-16-10-8-9-15-13-20(4,5)27-18(15)16/h8-10,14H,7,11-13H2,1-6H3
58 atoms
S  -2.645813 0.226162 1.23026
O  1.286914 -2.962474 0.89779
O  -0.193501 -0.63151 0.132626
O  -0.978527 -2.312878 -1.137567
O  1.317259 3.810898 1.159888
O  0.598298 3.651589 -0.950966
N  -2.897952 1.643465 0.418379
N  -2.403313 -1.040221 0.088503
C  2.193737 -4.107713 0.826248
C  3.523721 -3.520271 0.301313
C  3.07844 -2.232826 -0.322511
C  1.776838 -2.004158 0.098617
C  1.594643 -5.091565 -0.164302
C  2.301126 -4.695681 2.215452
C  3.718042 -1.323278 -1.142598
C  1.087223 -0.877071 -0.308241
C  3.032237 -0.177532 -1.541269
C  1.723103 0.040632 -1.131128
C  -4.215873 1.900927 -0.182381
C  -1.753282 2.304864 -0.19896
C  -4.268949 1.582965 -1.671938
C  -4.661149 3.330134 0.098678
C  -0.71773 2.713321 0.834162
C  -1.175692 -1.403619 -0.36679
C  0.454051 3.431706 0.228069
C  -3.536711 -1.81503 -0.399894
C  2.518422 4.493038 0.766554
C  3.602051 3.530513 0.340022
H  4.231676 -3.33576 1.11504
H  4.00938 -4.196878 -0.403228
H  1.509467 -4.654863 -1.161625
H  0.601478 -5.413682 0.152313
H  2.225439 -5.977824 -0.24322
H  2.679265 -3.962336 2.929187
H  2.990991 -5.54022 2.208391
H  1.335959 -5.059414 2.571551
H  4.735259 -1.494525 -1.471966
H  3.51365 0.545657 -2.185841
H  1.188619 0.926215 -1.451882
H  -4.908261 1.233242 0.334853
H  -1.304635 1.68084 -0.977701
H  -2.120198 3.199476 -0.702319
H  -5.290545 1.685916 -2.040936
H  -3.643829 2.261024 -2.256247
H  -3.945671 0.562869 -1.881044
H  -4.643169 3.544594 1.167704
H  -5.682622 3.478546 -0.254878
H  -4.03719 4.069518 -0.406988
H  -0.338273 1.84512 1.379513
H  -1.175565 3.363463 1.585243
H  -3.458701 -2.86126 -0.104009
H  -3.621007 -1.764661 -1.48499
H  -4.44667 -1.409329 0.031042
H  2.303128 5.223229 -0.014934
H  2.824242 5.041556 1.656512
H  3.34981 3.003415 -0.579843
H  3.808122 2.79335 1.11667
H  4.522135 4.088293 0.160019
elementType: S O N C H
totalener: -1664.20702457 hartree
nucrepener: 3060.85841933 hartree
electener: -4725.06544390 hartree
oneelecener: -8365.92852946 hartree
twoeener: 3640.86308556 hartree
cpcmener: -0.03540771 hartree
kineticenergy: 1657.92442579 hartree
xcener: -140.799610098926 hartree
chargesum: 0.0000000
charge: 0.017334 -0.366879 -0.320761 -0.484398 -0.294315 -0.469189 -0.137526 -0.164088 0.372818 -0.113104 -0.096193 0.249404 -0.328486 -0.293248 -0.192721 0.110851 -0.183849 -0.188962 0.070784 -0.150170 -0.278062 -0.275307 -0.110561 0.491021 0.407885 -0.188466 0.038528 -0.251905 0.090107 0.098381 0.109364 0.098792 0.101393 0.095788 0.098924 0.099871 0.149446 0.158413 0.148264 0.062066 0.116095 0.122574 0.098969 0.091138 0.097997 0.088688 0.095063 0.085038 0.102012 0.113550 0.125873 0.112198 0.105956 0.088723 0.108198 0.076720 0.090771 0.099191
qa: 0.0173 -0.3669 -0.3208 -0.4844 -0.2943 -0.4692 -0.1375 -0.1641 0.3728 -0.1131 -0.0962 0.2494 -0.3285 -0.2932 -0.1927 0.1109 -0.1838 -0.1890 0.0708 -0.1502 -0.2781 -0.2753 -0.1106 0.4910 0.4079 -0.1885 0.0385 -0.2519 0.0901 0.0984 0.1094 0.0988 0.1014 0.0958 0.0989 0.0999 0.1494 0.1584 0.1483 0.0621 0.1161 0.1226 0.0990 0.0911 0.0980 0.0887 0.0951 0.0850 0.1020 0.1136 0.1259 0.1122 0.1060 0.0887 0.1082 0.0767 0.0908 0.0992
va: 2.3530 2.1018 2.0945 2.0325 2.1372 2.0131 3.0049 3.1469 3.7031 3.9740 3.6549 3.9339 3.9756 3.9421 3.9597 3.8746 3.9028 3.9275 3.9101 3.9057 3.8998 3.9179 3.8467 4.2552 4.1608 3.8926 3.8572 3.9136 1.0091 1.0039 0.9993 1.0095 1.0064 1.0064 1.0029 1.0062 0.9989 0.9912 1.0089 1.0090 1.0002 1.0002 1.0063 1.0007 1.0036 1.0146 1.0039 1.0064 1.0352 1.0252 0.9984 0.9882 1.0054 1.0104 0.9955 1.0154 1.0043 1.0087
dispcorr: -0.033200462 hartree
energy: -1664.240225036370
dipole: -2.12573 2.46646 0.34073 2.96511 -2.54724 0.41787 -2.97502 3.67859 0.70357
magnitude: 0.88641 au
magnitude: 2.25307 debye
