program: Orca
programVersion: 5.0.3
elementType: S O O O O O N N C C C C C C C C C C C C C C C C C C C C H H H H H H H H H H H H H H H H H H H H H H H H H H H H H H
charge: 0
multiplicity: 1
keywords: wb97x-d3
keywords: def2-TZVPP
keywords: def2/J RIJCOSX
keywords: DEFGRID2
keywords: scfconv7
keywords: smallprint printgap noloewdin
keywords: NOSOSCF
formula: C20H30N2O5S
InChI: InChI=1/C20H30N2O5S/c1-7-25-17(23)11-12-22(14(2)3)28-21(6)19(24)26-16-10-8-9-15-13-20(4,5)27-18(15)16/h8-10,14H,7,11-13H2,1-6H3
58 atoms
S  -2.713052 0.904624 1.401242
O  0.789801 -1.382861 -1.095407
O  -0.136762 -0.247106 1.357192
O  -0.747423 -2.409791 1.393859
O  1.740165 2.726499 0.151035
O  1.129646 1.869167 -1.816343
N  -2.795163 1.456982 -0.160151
N  -2.32342 -0.774937 1.405567
C  1.545501 -2.169452 -2.069579
C  3.027607 -1.962344 -1.678163
C  2.9237 -1.442239 -0.276856
C  1.592543 -1.127474 -0.053609
C  1.206693 -1.636354 -3.444197
C  1.121619 -3.618039 -1.898055
C  3.868602 -1.214031 0.705502
C  1.177597 -0.600258 1.156204
C  3.458258 -0.669484 1.920652
C  2.120389 -0.367702 2.145425
C  -3.979343 1.192501 -0.992642
C  -1.542984 1.564191 -0.905643
C  -5.273995 1.372367 -0.222006
C  -3.93585 -0.155954 -1.703137
C  -0.562365 2.519509 -0.236862
C  -1.046358 -1.239279 1.379932
C  0.841514 2.322983 -0.733643
C  -3.376509 -1.777163 1.515295
C  3.130507 2.577119 -0.17849
C  3.938791 3.100427 0.981122
H  3.593521 -2.892164 -1.751614
H  3.516849 -1.232037 -2.3294
H  1.473294 -0.582804 -3.537643
H  0.142603 -1.74385 -3.661573
H  1.757691 -2.190509 -4.204656
H  1.646495 -4.250234 -2.615522
H  0.05049 -3.739131 -2.06666
H  1.3538 -3.987353 -0.896955
H  4.911491 -1.451017 0.535908
H  4.18198 -0.484593 2.703104
H  1.802362 0.049476 3.092833
H  -3.94934 1.973353 -1.759782
H  -1.089281 0.582258 -1.059436
H  -1.790404 1.939156 -1.899938
H  -5.443986 0.576171 0.503536
H  -5.297812 2.325779 0.307171
H  -6.110886 1.359765 -0.921425
H  -4.011768 -0.986503 -1.000745
H  -3.019572 -0.286378 -2.281234
H  -4.77141 -0.240066 -2.399775
H  -0.577684 2.409561 0.847151
H  -0.851395 3.555509 -0.44162
H  -3.40298 -2.436283 0.646645
H  -4.33388 -1.26867 1.590336
H  -3.247302 -2.386782 2.410674
H  3.349784 1.522522 -0.360394
H  3.356912 3.131683 -1.091927
H  3.723897 2.557569 1.902173
H  3.759451 4.162275 1.153422
H  4.999117 2.974263 0.761504
elementType: S O N C H
totalener: -1664.20718832 hartree
nucrepener: 3225.90873101 hartree
electener: -4890.11591932 hartree
oneelecener: -8696.54498668 hartree
twoeener: 3806.42906735 hartree
cpcmener: -0.03501183 hartree
kineticenergy: 1657.92123188 hartree
xcener: -140.801064374592 hartree
chargesum: 0.0000000
charge: 0.015908 -0.352514 -0.312319 -0.478854 -0.283897 -0.467975 -0.134463 -0.158444 0.360342 -0.136192 -0.123443 0.343955 -0.305240 -0.325248 -0.135100 0.043894 -0.207809 -0.180997 0.059884 -0.125247 -0.268366 -0.289137 -0.102190 0.478284 0.391268 -0.201044 0.007639 -0.254558 0.101886 0.090766 0.096175 0.100014 0.105227 0.101170 0.098881 0.109270 0.145216 0.154590 0.144047 0.059914 0.091554 0.114741 0.085106 0.096659 0.095685 0.094287 0.097040 0.102464 0.095099 0.115608 0.116207 0.112179 0.126157 0.098022 0.118681 0.086718 0.096464 0.092035
qa: 0.0159 -0.3525 -0.3123 -0.4789 -0.2839 -0.4680 -0.1345 -0.1584 0.3603 -0.1362 -0.1234 0.3440 -0.3052 -0.3252 -0.1351 0.0439 -0.2078 -0.1810 0.0599 -0.1252 -0.2684 -0.2891 -0.1022 0.4783 0.3913 -0.2010 0.0076 -0.2546 0.1019 0.0908 0.0962 0.1000 0.1052 0.1012 0.0989 0.1093 0.1452 0.1546 0.1440 0.0599 0.0916 0.1147 0.0851 0.0967 0.0957 0.0943 0.0970 0.1025 0.0951 0.1156 0.1162 0.1122 0.1262 0.0980 0.1187 0.0867 0.0965 0.0920
va: 2.3679 2.0655 2.0793 2.0361 2.1178 2.0196 3.0648 3.1494 3.7380 4.0241 3.6959 3.7546 3.9338 3.9724 3.8823 3.7062 3.8527 3.9422 3.9184 3.9356 3.9139 3.8961 3.7943 4.2643 4.1640 3.8994 3.8336 3.9566 1.0030 1.0098 1.0105 1.0051 1.0045 1.0061 1.0093 0.9989 0.9973 0.9899 1.0002 1.0009 1.0080 1.0051 1.0060 1.0121 1.0057 0.9960 1.0046 1.0086 1.0549 1.0115 0.9835 0.9993 0.9997 0.9884 1.0050 1.0043 1.0051 1.0065
dispcorr: -0.037974928 hartree
energy: -1664.245163243812
dipole: -4.22153 4.39343 0.17191 -1.42848 2.00278 0.57430 -16.01091 15.13512 -0.87579
magnitude: 1.06131 au
magnitude: 2.69763 debye
