program: Orca
programVersion: 5.0.3
elementType: S O O O O O N N C C C C C C C C C C C C C C C C C C C C H H H H H H H H H H H H H H H H H H H H H H H H H H H H H H
charge: 0
multiplicity: 1
keywords: wb97x-d3
keywords: def2-TZVPP
keywords: def2/J RIJCOSX
keywords: DEFGRID2
keywords: scfconv7
keywords: smallprint printgap noloewdin
keywords: NOSOSCF
formula: C20H30N2O5S
InChI: InChI=1/C20H30N2O5S/c1-7-25-17(23)11-12-22(14(2)3)28-21(6)19(24)26-16-10-8-9-15-13-20(4,5)27-18(15)16/h8-10,14H,7,11-13H2,1-6H3
58 atoms
S  -2.692593 0.879999 1.567449
O  0.779431 -1.391593 -0.958071
O  -0.120971 -0.307442 1.529269
O  -0.768793 -2.460111 1.521039
O  1.538295 3.410488 -0.13665
O  1.104002 1.804961 -1.629413
N  -2.805067 1.384023 -0.006684
N  -2.315658 -0.800621 1.598988
C  1.510962 -2.181361 -1.948253
C  2.997924 -2.028512 -1.551607
C  2.907437 -1.542516 -0.137159
C  1.587068 -1.188844 0.091646
C  1.192677 -1.612836 -3.31367
C  1.040429 -3.618583 -1.805059
C  3.855205 -1.380264 0.855409
C  1.18522 -0.686225 1.316582
C  3.45897 -0.861157 2.086014
C  2.131675 -0.519888 2.315937
C  -4.000707 1.012125 -0.782671
C  -1.564453 1.530827 -0.765753
C  -3.788296 -0.215965 -1.660555
C  -4.499201 2.196938 -1.599615
C  -0.628019 2.540563 -0.12469
C  -1.04733 -1.284709 1.542136
C  0.747264 2.525054 -0.728047
C  -3.387399 -1.786419 1.666692
C  2.92003 3.47394 -0.523192
C  3.743272 2.40877 0.163624
H  3.536393 -2.972337 -1.64905
H  3.509184 -1.296231 -2.183563
H  0.127818 -1.690307 -3.539998
H  1.735287 -2.16576 -4.081167
H  1.485605 -0.564799 -3.386298
H  1.544033 -4.254276 -2.534489
H  -0.034225 -3.700322 -1.975382
H  1.259864 -4.014466 -0.811292
H  4.889641 -1.649361 0.681966
H  4.185366 -0.727311 2.876319
H  1.824539 -0.123763 3.275913
H  -4.768392 0.774645 -0.043255
H  -1.069014 0.567036 -0.901303
H  -1.824852 1.878972 -1.765892
H  -3.400999 -1.063512 -1.094532
H  -4.735705 -0.524191 -2.105285
H  -3.096614 -0.016907 -2.481304
H  -5.435041 1.939021 -2.097583
H  -3.79259 2.492746 -2.377292
H  -4.6876 3.062721 -0.964082
H  -0.518605 2.350628 0.945966
H  -1.040818 3.549846 -0.208028
H  -3.42639 -2.408499 0.772534
H  -4.333978 -1.262804 1.761267
H  -3.271613 -2.433422 2.536137
H  3.015474 3.41543 -1.608503
H  3.244961 4.467103 -0.215931
H  3.657719 2.479456 1.248212
H  4.793971 2.546323 -0.095919
H  3.456558 1.403352 -0.143838
elementType: S O N C H
totalener: -1664.20732766 hartree
nucrepener: 3208.96851903 hartree
electener: -4873.17584670 hartree
oneelecener: -8662.91626413 hartree
twoeener: 3789.74041743 hartree
cpcmener: -0.03495907 hartree
kineticenergy: 1657.92097522 hartree
xcener: -140.800579935354 hartree
chargesum: -0.0000000
charge: 0.017083 -0.348782 -0.318063 -0.478585 -0.296137 -0.469493 -0.137666 -0.164690 0.358836 -0.127866 -0.073918 0.283912 -0.309416 -0.324520 -0.171528 0.076797 -0.181673 -0.197802 0.083245 -0.145935 -0.281693 -0.280121 -0.108060 0.480651 0.412838 -0.178214 0.040760 -0.240811 0.101366 0.090755 0.100217 0.106090 0.097257 0.101426 0.098665 0.109280 0.144612 0.153111 0.144937 0.062964 0.089401 0.127759 0.093502 0.101491 0.091291 0.094685 0.084812 0.089282 0.098357 0.116541 0.111644 0.103401 0.121622 0.088394 0.107569 0.089900 0.100798 0.059720
qa: 0.0171 -0.3488 -0.3181 -0.4786 -0.2961 -0.4695 -0.1377 -0.1647 0.3588 -0.1279 -0.0739 0.2839 -0.3094 -0.3245 -0.1715 0.0768 -0.1817 -0.1978 0.0832 -0.1459 -0.2817 -0.2801 -0.1081 0.4807 0.4128 -0.1782 0.0408 -0.2408 0.1014 0.0908 0.1002 0.1061 0.0973 0.1014 0.0987 0.1093 0.1446 0.1531 0.1449 0.0630 0.0894 0.1278 0.0935 0.1015 0.0913 0.0947 0.0848 0.0893 0.0984 0.1165 0.1116 0.1034 0.1216 0.0884 0.1076 0.0899 0.1008 0.0597
va: 2.3560 2.0661 2.0734 2.0358 2.1331 2.0065 3.0198 3.1547 3.7338 4.0131 3.6318 3.8450 3.9369 3.9736 3.9165 3.7226 3.8603 3.9760 3.8948 3.9295 3.8987 3.9247 3.8177 4.2623 4.1468 3.8883 3.8677 3.9097 1.0034 1.0091 1.0050 1.0043 1.0102 1.0062 1.0091 0.9991 0.9992 0.9913 0.9992 1.0079 1.0149 0.9995 1.0075 1.0068 1.0001 1.0037 1.0067 1.0143 1.0462 1.0203 0.9870 1.0085 0.9988 1.0110 0.9960 1.0049 1.0107 1.0199
dispcorr: -0.037360088 hartree
energy: -1664.244687752225
dipole: -3.14306 3.27721 0.13416 -0.95969 1.70704 0.74735 -20.59014 19.52842 -1.06172
magnitude: 1.30529 au
magnitude: 3.31778 debye
