program: Orca
programVersion: 5.0.3
elementType: S O O O O O N N C C C C C C C C C C C C C C C C C C C C H H H H H H H H H H H H H H H H H H H H H H H H H H H H H H
charge: 0
multiplicity: 1
keywords: wb97x-d3
keywords: def2-TZVPP
keywords: def2/J RIJCOSX
keywords: DEFGRID2
keywords: scfconv7
keywords: smallprint printgap noloewdin
keywords: NOSOSCF
formula: C20H30N2O5S
InChI: InChI=1/C20H30N2O5S/c1-7-25-17(23)11-12-22(14(2)3)28-21(6)19(24)26-16-10-8-9-15-13-20(4,5)27-18(15)16/h8-10,14H,7,11-13H2,1-6H3
58 atoms
S  -2.710919 0.868808 1.527455
O  0.611352 -1.523079 -0.952067
O  -0.161797 -0.294058 1.509111
O  -0.748582 -2.456464 1.649572
O  1.754202 2.75063 0.151959
O  1.106508 1.839389 -1.778634
N  -2.778572 1.345074 -0.058376
N  -2.336067 -0.815996 1.5915
C  1.328088 -2.256647 -1.99544
C  2.827906 -2.005786 -1.703471
C  2.80662 -1.438182 -0.317559
C  1.483662 -1.185337 0.006183
C  0.880396 -1.699609 -3.329698
C  0.96341 -3.722006 -1.840107
C  3.815803 -1.11486 0.569776
C  1.14166 -0.619528 1.222364
C  3.478589 -0.536523 1.79148
C  2.1495 -0.291468 2.115593
C  -3.951938 0.952779 -0.859929
C  -1.521279 1.459855 -0.795463
C  -3.711149 -0.292846 -1.707131
C  -4.431345 2.118528 -1.714761
C  -0.548946 2.425239 -0.133215
C  -1.06356 -1.29228 1.585163
C  0.840487 2.29175 -0.689833
C  -3.447535 -1.741606 1.753572
C  3.133081 2.698793 -0.248219
C  3.961993 3.245297 0.885612
H  3.40728 -2.927542 -1.777968
H  3.261535 -1.293496 -2.411212
H  -0.188908 -1.851743 -3.487147
H  1.410156 -2.202142 -4.139711
H  1.091601 -0.632054 -3.403403
H  1.461917 -4.31682 -2.606573
H  -0.111931 -3.874623 -1.94534
H  1.27055 -4.108894 -0.866365
H  4.852768 -1.300874 0.319638
H  4.253878 -0.275815 2.499283
H  1.889255 0.16013 3.064881
H  -4.739143 0.728211 -0.137552
H  -1.059958 0.47972 -0.935815
H  -1.756484 1.826818 -1.794646
H  -3.315586 -1.121399 -1.11826
H  -4.649371 -0.624762 -2.154358
H  -3.014424 -0.102271 -2.52581
H  -4.633894 2.998536 -1.103598
H  -5.355913 1.848631 -2.227253
H  -3.707548 2.396144 -2.483149
H  -0.514797 2.281847 0.94631
H  -0.87766 3.457662 -0.29155
H  -4.205506 -1.557383 0.994878
H  -3.90686 -1.627711 2.735651
H  -3.111091 -2.769321 1.65087
H  3.412856 1.666899 -0.471155
H  3.275834 3.290528 -1.15528
H  3.844048 2.654108 1.79432
H  3.707614 4.281716 1.110197
H  5.014866 3.215703 0.604277
elementType: S O N C H
totalener: -1664.20660657 hartree
nucrepener: 3229.44046573 hartree
electener: -4893.64707230 hartree
oneelecener: -8703.42931454 hartree
twoeener: 3809.78224224 hartree
cpcmener: -0.03405045 hartree
kineticenergy: 1657.92185214 hartree
xcener: -140.800778795214 hartree
chargesum: 0.0000000
charge: 0.022245 -0.350670 -0.311087 -0.476521 -0.282512 -0.468451 -0.141291 -0.154773 0.355017 -0.140901 -0.119772 0.372760 -0.306789 -0.321615 -0.153993 0.038883 -0.191495 -0.196636 0.087182 -0.137198 -0.285365 -0.283254 -0.106253 0.455909 0.390374 -0.183115 0.004690 -0.251066 0.101417 0.092052 0.099126 0.107230 0.096577 0.100888 0.098736 0.108555 0.144332 0.154820 0.143746 0.064044 0.087603 0.125522 0.090544 0.104154 0.091565 0.089416 0.095075 0.085317 0.098132 0.117526 0.108073 0.125800 0.113968 0.099964 0.119467 0.086193 0.094539 0.091315
qa: 0.0222 -0.3507 -0.3111 -0.4765 -0.2825 -0.4685 -0.1413 -0.1548 0.3550 -0.1409 -0.1198 0.3728 -0.3068 -0.3216 -0.1540 0.0389 -0.1915 -0.1966 0.0872 -0.1372 -0.2854 -0.2833 -0.1063 0.4559 0.3904 -0.1831 0.0047 -0.2511 0.1014 0.0921 0.0991 0.1072 0.0966 0.1009 0.0987 0.1086 0.1443 0.1548 0.1437 0.0640 0.0876 0.1255 0.0905 0.1042 0.0916 0.0894 0.0951 0.0853 0.0981 0.1175 0.1081 0.1258 0.1140 0.1000 0.1195 0.0862 0.0945 0.0913
va: 2.3419 2.0653 2.0637 2.0430 2.1212 2.0151 3.0289 3.1416 3.7416 4.0447 3.7021 3.7281 3.9357 3.9728 3.8818 3.7087 3.8384 3.9437 3.8875 3.9355 3.8915 3.9284 3.8073 4.2964 4.1627 3.8934 3.8325 3.9580 1.0032 1.0093 1.0052 1.0047 1.0114 1.0056 1.0083 0.9987 0.9979 0.9888 1.0009 1.0096 1.0131 1.0038 1.0099 1.0060 0.9999 1.0142 1.0034 1.0063 1.0520 1.0127 0.9872 0.9939 1.0172 0.9889 1.0033 1.0041 1.0049 1.0067
dispcorr: -0.038189306 hartree
energy: -1664.244795878660
dipole: -2.80053 2.96833 0.16780 0.29920 0.27934 0.57854 -19.56609 18.52342 -1.04266
magnitude: 1.20416 au
magnitude: 3.06074 debye
