program: Orca
programVersion: 5.0.3
elementType: S O O O O O N N C C C C C C C C C C C C C C C C C C C C H H H H H H H H H H H H H H H H H H H H H H H H H H H H H H
charge: 0
multiplicity: 1
keywords: wb97x-d3
keywords: def2-TZVPP
keywords: def2/J RIJCOSX
keywords: DEFGRID2
keywords: scfconv7
keywords: smallprint printgap noloewdin
keywords: NOSOSCF
formula: C20H30N2O5S
InChI: InChI=1/C20H30N2O5S/c1-7-25-17(23)11-12-22(14(2)3)28-21(6)19(24)26-16-10-8-9-15-13-20(4,5)27-18(15)16/h8-10,14H,7,11-13H2,1-6H3
58 atoms
S  -1.765848 1.254258 1.255785
O  0.694286 -2.259011 -0.971124
O  0.312939 -0.650704 1.363581
O  -0.95114 -2.482734 1.713722
O  0.797202 4.198331 0.2079
O  -0.239714 4.060715 -1.763908
N  -1.846822 1.512402 -0.376964
N  -1.913448 -0.429135 1.56146
C  1.102843 -3.346019 -1.842847
C  2.609722 -3.542728 -1.548596
C  2.753299 -2.890502 -0.206154
C  1.595648 -2.16497 0.018552
C  0.818943 -2.925146 -3.269812
C  0.300396 -4.576146 -1.445745
C  3.777159 -2.877619 0.720602
C  1.432124 -1.419463 1.171848
C  3.622039 -2.125957 1.880707
C  2.456906 -1.404429 2.103652
C  -3.147606 1.421437 -1.050502
C  -0.662155 1.252094 -1.187538
C  -3.347744 0.095809 -1.780749
C  -3.368665 2.610253 -1.977654
C  0.541894 2.046164 -0.714532
C  -0.857723 -1.298047 1.553325
C  0.304434 3.53119 -0.832539
C  -3.223832 -1.012288 1.804897
C  0.662637 5.620334 0.197124
C  1.265481 6.150245 1.47642
H  2.882611 -4.599385 -1.55049
H  3.236226 -3.045236 -2.296017
H  -0.246692 -2.755193 -3.426708
H  1.136161 -3.705418 -3.962121
H  1.35361 -2.009776 -3.525768
H  0.491764 -4.856383 -0.408995
H  0.564434 -5.422815 -2.080924
H  -0.768996 -4.393803 -1.550431
H  4.686027 -3.44019 0.550322
H  4.409571 -2.105109 2.621228
H  2.334236 -0.821658 3.007164
H  -3.891107 1.485152 -0.252701
H  -0.409682 0.188364 -1.217075
H  -0.88997 1.54672 -2.212308
H  -2.675186 -0.001255 -2.634774
H  -3.177435 -0.757877 -1.124574
H  -4.366484 0.025291 -2.163805
H  -3.249174 3.549115 -1.440148
H  -4.377345 2.576334 -2.391714
H  -2.671469 2.621166 -2.815609
H  1.394027 1.792872 -1.353125
H  0.822466 1.774849 0.301466
H  -3.942537 -0.203642 1.902866
H  -3.228479 -1.59596 2.724539
H  -3.538046 -1.664183 0.988518
H  1.168988 6.036631 -0.677216
H  -0.392316 5.893412 0.118953
H  0.752405 5.7557 2.352809
H  1.179318 7.236512 1.498753
H  2.322349 5.897441 1.556039
totalener: -1664.17988222 hartree
nucrepener: 3098.95397683 hartree
electener: -4763.13385905 hartree
oneelecener: -8440.82214096 hartree
twoeener: 3677.68828191 hartree
kineticenergy: 1657.99789233 hartree
xcener: -140.804632095283 hartree
chargesum: -0.0000000
charge: 0.036629 -0.333238 -0.320580 -0.376204 -0.260136 -0.380899 -0.128291 -0.179482 0.317766 -0.155992 -0.077117 0.319358 -0.283986 -0.291260 -0.154703 0.082163 -0.110956 -0.175474 0.042108 -0.148706 -0.255456 -0.247426 -0.117627 0.424805 0.340796 -0.174183 0.036073 -0.230678 0.089797 0.080387 0.093614 0.092723 0.088782 0.114772 0.083658 0.092164 0.117497 0.119378 0.120414 0.051079 0.107027 0.118386 0.080496 0.087792 0.091900 0.090536 0.083688 0.083322 0.092099 0.099431 0.093825 0.118295 0.099766 0.083786 0.084156 0.085463 0.076004 0.082464
qa: 0.0366 -0.3332 -0.3206 -0.3762 -0.2601 -0.3809 -0.1283 -0.1795 0.3178 -0.1560 -0.0771 0.3194 -0.2840 -0.2913 -0.1547 0.0822 -0.1110 -0.1755 0.0421 -0.1487 -0.2555 -0.2474 -0.1176 0.4248 0.3408 -0.1742 0.0361 -0.2307 0.0898 0.0804 0.0936 0.0927 0.0888 0.1148 0.0837 0.0922 0.1175 0.1194 0.1204 0.0511 0.1070 0.1184 0.0805 0.0878 0.0919 0.0905 0.0837 0.0833 0.0921 0.0994 0.0938 0.1183 0.0998 0.0838 0.0842 0.0855 0.0760 0.0825
va: 2.3759 2.0938 2.0655 2.1417 2.1288 2.1148 2.9904 3.1504 3.8382 3.9989 3.7187 3.8873 3.9291 3.9715 4.0121 3.8455 3.9349 4.0733 3.9690 3.9495 3.8932 3.9275 3.8502 4.3065 4.2050 3.9077 3.8832 3.9597 1.0030 1.0048 1.0091 1.0069 1.0098 1.0035 1.0063 1.0140 1.0054 1.0014 1.0065 1.0084 1.0177 1.0040 1.0052 1.0123 1.0097 1.0192 1.0065 1.0137 1.0173 1.0439 1.0102 1.0025 0.9901 0.9987 0.9991 1.0053 1.0085 1.0056
dispcorr: -0.033421381 hartree
energy: -1664.213303596957
dipole: -8.15223 8.49460 0.34237 3.05965 -3.26502 -0.20537 -17.37546 16.79225 -0.58321
magnitude: 0.70677 au
magnitude: 1.79648 debye
