program: Orca
programVersion: 5.0.3
elementType: S O O O O O N N C C C C C C C C C C C C C C C C C C C C H H H H H H H H H H H H H H H H H H H H H H H H H H H H H H
charge: 0
multiplicity: 1
keywords: wb97x-d3
keywords: def2-TZVPP
keywords: def2/J RIJCOSX
keywords: DEFGRID2
keywords: scfconv7
keywords: smallprint printgap noloewdin
keywords: NOSOSCF
formula: C20H30N2O5S
InChI: InChI=1/C20H30N2O5S/c1-7-25-17(23)11-12-22(14(2)3)28-21(6)19(24)26-16-10-8-9-15-13-20(4,5)27-18(15)16/h8-10,14H,7,11-13H2,1-6H3
58 atoms
S  -1.845213 1.167811 1.303013
O  0.710841 -2.251892 -0.92803
O  0.243736 -0.727516 1.448356
O  -1.022939 -2.579406 1.658531
O  0.801292 4.172644 0.505355
O  -0.202223 4.109651 -1.492235
N  -1.84068 1.50238 -0.317486
N  -1.99367 -0.529679 1.517675
C  1.159265 -3.301646 -1.825509
C  2.659416 -3.490931 -1.493695
C  2.755197 -2.884922 -0.125586
C  1.582109 -2.181909 0.09022
C  0.912266 -2.833506 -3.244482
C  0.361981 -4.554806 -1.496964
C  3.753229 -2.889779 0.829236
C  1.375973 -1.477708 1.262888
C  3.555626 -2.179424 2.008516
C  2.374763 -1.481045 2.222689
C  -3.104295 1.431937 -1.061333
C  -0.612965 1.283748 -1.074123
C  -3.256261 0.136817 -1.85429
C  -3.288818 2.657319 -1.947565
C  0.558232 2.059607 -0.50012
C  -0.930902 -1.389184 1.545886
C  0.324394 3.548131 -0.569313
C  -3.310667 -1.133588 1.653336
C  0.6972 5.59614 0.553646
C  1.805293 6.279575 -0.219865
H  2.945342 -4.543714 -1.524305
H  3.301484 -2.960277 -2.204167
H  -0.150058 -2.66741 -3.426208
H  1.256637 -3.586393 -3.95387
H  1.445197 -1.905379 -3.453414
H  0.657853 -5.375237 -2.152052
H  -0.706195 -4.382981 -1.628885
H  0.52555 -4.867666 -0.464953
H  4.67447 -3.433884 0.665529
H  4.322128 -2.172577 2.771037
H  2.219413 -0.930438 3.141234
H  -3.887999 1.457271 -0.300721
H  -0.353006 0.223199 -1.137806
H  -0.786912 1.624333 -2.095159
H  -2.542093 0.079574 -2.677688
H  -3.110325 -0.741916 -1.225945
H  -4.254507 0.0747 -2.289322
H  -4.275705 2.635075 -2.411864
H  -2.551641 2.707724 -2.749068
H  -3.202801 3.573006 -1.365677
H  1.44756 1.834025 -1.097475
H  0.782221 1.74737 0.51823
H  -3.377375 -1.732285 2.560844
H  -3.552617 -1.776249 0.806144
H  -4.046241 -0.33642 1.708457
H  -0.281733 5.917274 0.193588
H  0.764106 5.841525 1.613258
H  1.730165 6.084074 -1.28809
H  2.786905 5.957484 0.127453
H  1.739206 7.358389 -0.074365
totalener: -1664.17922327 hartree
nucrepener: 3100.77030801 hartree
electener: -4764.94953128 hartree
oneelecener: -8444.49320686 hartree
twoeener: 3679.54367558 hartree
kineticenergy: 1657.99988553 hartree
xcener: -140.806120422891 hartree
chargesum: -0.0000000
charge: 0.036803 -0.333747 -0.319814 -0.375651 -0.265374 -0.388247 -0.125669 -0.180224 0.318112 -0.156070 -0.078397 0.322315 -0.283509 -0.291776 -0.154928 0.081102 -0.110219 -0.176910 0.038722 -0.148979 -0.254776 -0.247350 -0.128445 0.425118 0.358960 -0.176934 0.035223 -0.256000 0.089729 0.080147 0.093601 0.092699 0.088295 0.083631 0.092174 0.115058 0.117419 0.119346 0.120455 0.051743 0.107324 0.117788 0.080020 0.088543 0.091865 0.083442 0.082891 0.091204 0.091526 0.101033 0.118599 0.101154 0.094361 0.083286 0.096187 0.098278 0.083417 0.081452
qa: 0.0368 -0.3337 -0.3198 -0.3757 -0.2654 -0.3882 -0.1257 -0.1802 0.3181 -0.1561 -0.0784 0.3223 -0.2835 -0.2918 -0.1549 0.0811 -0.1102 -0.1769 0.0387 -0.1490 -0.2548 -0.2473 -0.1284 0.4251 0.3590 -0.1769 0.0352 -0.2560 0.0897 0.0801 0.0936 0.0927 0.0883 0.0836 0.0922 0.1151 0.1174 0.1193 0.1205 0.0517 0.1073 0.1178 0.0800 0.0885 0.0919 0.0834 0.0829 0.0912 0.0915 0.1010 0.1186 0.1012 0.0944 0.0833 0.0962 0.0983 0.0834 0.0815
va: 2.3763 2.0925 2.0651 2.1425 2.1327 2.1013 2.9892 3.1497 3.8383 3.9999 3.7206 3.8811 3.9286 3.9715 4.0122 3.8472 3.9333 4.0695 3.9731 3.9439 3.8919 3.9281 3.8481 4.3067 4.1969 3.9087 3.8873 3.9134 1.0030 1.0048 1.0091 1.0070 1.0099 1.0063 1.0140 1.0035 1.0054 1.0013 1.0068 1.0081 1.0178 1.0046 1.0051 1.0121 1.0098 1.0064 1.0135 1.0192 1.0173 1.0444 1.0025 0.9898 1.0097 1.0129 0.9952 1.0126 1.0049 1.0105
dispcorr: -0.033690707 hartree
energy: -1664.212913981117
dipole: -6.15336 6.55934 0.40598 4.08043 -4.22299 -0.14256 -21.36553 20.66765 -0.69788
magnitude: 0.81986 au
magnitude: 2.08393 debye
