program: Orca
programVersion: 5.0.3
elementType: S O O O O O N N C C C C C C C C C C C C C C C C C C C C H H H H H H H H H H H H H H H H H H H H H H H H H H H H H H
charge: 0
multiplicity: 1
keywords: wb97x-d3
keywords: def2-TZVPP
keywords: def2/J RIJCOSX
keywords: DEFGRID2
keywords: scfconv7
keywords: smallprint printgap noloewdin
keywords: NOSOSCF
formula: C20H30N2O5S
InChI: InChI=1/C20H30N2O5S/c1-7-25-17(23)11-12-22(14(2)3)28-21(6)19(24)26-16-10-8-9-15-13-20(4,5)27-18(15)16/h8-10,14H,7,11-13H2,1-6H3
58 atoms
S  -1.656725 1.284525 1.278754
O  0.782515 -2.242274 -0.951669
O  0.354068 -0.688022 1.411778
O  -0.977135 -2.482415 1.699972
O  1.008144 4.111188 0.182949
O  0.002681 3.996981 -1.810572
N  -1.739567 1.566043 -0.350796
N  -1.868484 -0.396064 1.557763
C  1.200219 -3.308024 -1.845545
C  2.68466 -3.565047 -1.489123
C  2.788532 -2.958435 -0.122259
C  1.643972 -2.205134 0.07664
C  1.002065 -2.824548 -3.267495
C  0.341642 -4.524988 -1.53526
C  3.773223 -3.004032 0.845172
C  1.454913 -1.48819 1.244075
C  3.591736 -2.282791 2.020395
C  2.439881 -1.532805 2.216979
C  -3.051727 1.561091 -1.009475
C  -0.582244 1.232951 -1.174324
C  -3.334121 0.267101 -1.76809
C  -3.215119 2.782516 -1.905295
C  0.669857 1.96445 -0.724837
C  -0.84114 -1.29908 1.562031
C  0.504564 3.457235 -0.860965
C  -3.20191 -0.939203 1.768123
C  0.915613 5.536879 0.184466
C  -0.448924 6.018266 0.630891
H  2.922547 -4.629965 -1.511295
H  3.361251 -3.068179 -2.191959
H  1.325405 -3.590751 -3.972584
H  1.581997 -1.921883 -3.462769
H  -0.047392 -2.608676 -3.469912
H  0.615518 -5.358401 -2.183295
H  -0.714568 -4.306807 -1.691884
H  0.467764 -4.843338 -0.499848
H  4.671697 -3.588503 0.694368
H  4.347608 -2.307723 2.793084
H  2.297101 -0.972911 3.131924
H  -3.781421 1.646511 -0.201179
H  -0.389066 0.156694 -1.194741
H  -0.806046 1.528771 -2.199565
H  -3.197093 -0.610786 -1.136581
H  -4.362108 0.259378 -2.132222
H  -2.683792 0.157601 -2.637466
H  -2.508775 2.78726 -2.735443
H  -3.062217 3.700211 -1.339748
H  -4.220287 2.804045 -2.328513
H  1.498896 1.65684 -1.369589
H  0.945289 1.691172 0.291986
H  -3.89722 -0.108948 1.852393
H  -3.246824 -1.525578 2.684925
H  -3.516923 -1.578395 0.942393
H  1.683747 5.862376 0.88543
H  1.165062 5.936341 -0.800124
H  -1.223197 5.752029 -0.086338
H  -0.440065 7.104678 0.724446
H  -0.714936 5.601875 1.602036
totalener: -1664.17932056 hartree
nucrepener: 3111.47299315 hartree
electener: -4775.65231371 hartree
oneelecener: -8465.85118537 hartree
twoeener: 3690.19887166 hartree
kineticenergy: 1658.00056827 hartree
xcener: -140.806134489767 hartree
chargesum: 0.0000000
charge: 0.036111 -0.333311 -0.320343 -0.375917 -0.262487 -0.386345 -0.127731 -0.176310 0.317669 -0.155902 -0.076525 0.320920 -0.284379 -0.291160 -0.152734 0.078434 -0.113501 -0.172050 0.041506 -0.156601 -0.255691 -0.247984 -0.120728 0.423806 0.346954 -0.178246 0.032190 -0.252224 0.089341 0.080915 0.093232 0.088793 0.093717 0.083003 0.091885 0.115432 0.117565 0.119351 0.120242 0.051847 0.111656 0.117845 0.089240 0.091717 0.081136 0.086498 0.085283 0.084101 0.091895 0.099740 0.094876 0.118696 0.101228 0.095046 0.085269 0.093947 0.082820 0.086260
qa: 0.0361 -0.3333 -0.3203 -0.3759 -0.2625 -0.3863 -0.1277 -0.1763 0.3177 -0.1559 -0.0765 0.3209 -0.2844 -0.2912 -0.1527 0.0784 -0.1135 -0.1720 0.0415 -0.1566 -0.2557 -0.2480 -0.1207 0.4238 0.3470 -0.1782 0.0322 -0.2522 0.0893 0.0809 0.0932 0.0888 0.0937 0.0830 0.0919 0.1154 0.1176 0.1194 0.1202 0.0518 0.1117 0.1178 0.0892 0.0917 0.0811 0.0865 0.0853 0.0841 0.0919 0.0997 0.0949 0.1187 0.1012 0.0950 0.0853 0.0939 0.0828 0.0863
va: 2.3748 2.0944 2.0669 2.1421 2.1347 2.1043 2.9837 3.1496 3.8335 4.0004 3.7192 3.8846 3.9303 3.9721 4.0111 3.8477 3.9388 4.0726 3.9640 3.9501 3.8918 3.9349 3.8493 4.3064 4.2144 3.9097 3.8871 3.9122 1.0032 1.0046 1.0067 1.0096 1.0093 1.0063 1.0137 1.0032 1.0053 1.0014 1.0064 1.0085 1.0159 1.0048 1.0115 1.0099 1.0053 1.0137 1.0159 1.0076 1.0179 1.0460 1.0090 1.0028 0.9897 0.9957 1.0120 1.0123 1.0110 1.0058
dispcorr: -0.034165519 hartree
energy: -1664.213486080949
dipole: -11.36278 11.61791 0.25513 3.84751 -4.04084 -0.19333 -19.05147 18.44231 -0.60915
magnitude: 0.68814 au
magnitude: 1.74910 debye
