program: Orca
programVersion: 5.0.3
elementType: S O O O O O N N C C C C C C C C C C C C C C C C C C C C H H H H H H H H H H H H H H H H H H H H H H H H H H H H H H
charge: 0
multiplicity: 1
keywords: wb97x-d3
keywords: def2-TZVPP
keywords: def2/J RIJCOSX
keywords: DEFGRID2
keywords: scfconv7
keywords: smallprint printgap noloewdin
keywords: NOSOSCF
formula: C20H30N2O5S
InChI: InChI=1/C20H30N2O5S/c1-7-25-17(23)11-12-22(14(2)3)28-21(6)19(24)26-16-10-8-9-15-13-20(4,5)27-18(15)16/h8-10,14H,7,11-13H2,1-6H3
58 atoms
S  -1.583797 1.288388 1.273483
O  0.708577 -2.294984 -0.963143
O  0.422559 -0.695348 1.389021
O  -0.913201 -2.478513 1.722836
O  0.838243 4.123696 0.386928
O  0.061792 4.083009 -1.710841
N  -1.653385 1.548926 -0.360086
N  -1.795088 -0.3885 1.575652
C  1.059719 -3.392527 -1.846541
C  2.562761 -3.647429 -1.579728
C  2.752151 -3.013666 -0.234144
C  1.627146 -2.245817 0.014278
C  0.767357 -2.953825 -3.266281
C  0.217348 -4.592161 -1.438565
C  3.789892 -3.047678 0.676555
C  1.508202 -1.505321 1.176337
C  3.680065 -2.301637 1.845487
C  2.546091 -1.539159 2.09305
C  -2.953339 1.492925 -1.038775
C  -0.472849 1.261512 -1.167287
C  -3.175195 0.18288 -1.790492
C  -3.146636 2.700562 -1.947515
C  0.74755 2.027448 -0.684841
C  -0.77363 -1.297592 1.569548
C  0.499248 3.514116 -0.746382
C  -3.129629 -0.922612 1.800376
C  0.64123 5.536118 0.470981
C  -0.794876 5.894274 0.79096
H  2.796912 -4.713229 -1.596362
H  3.194668 -3.165409 -2.332788
H  -0.292744 -2.738012 -3.403086
H  1.038597 -3.74401 -3.966882
H  1.335752 -2.061011 -3.529041
H  0.431846 -5.444834 -2.084292
H  -0.845765 -4.365465 -1.517166
H  0.42055 -4.886309 -0.407964
H  4.674542 -3.641915 0.487169
H  4.478801 -2.317188 2.57405
H  2.459704 -0.961911 3.004276
H  -3.699212 1.558199 -0.243418
H  -0.246264 0.192251 -1.202032
H  -0.688567 1.568848 -2.191064
H  -4.194805 0.135427 -2.17465
H  -2.504264 0.088435 -2.646046
H  -3.018831 -0.684047 -1.148301
H  -2.434326 2.719228 -2.772682
H  -3.027018 3.627893 -1.389567
H  -4.148137 2.686922 -2.379722
H  1.583613 1.795476 -1.350935
H  1.039597 1.716714 0.316256
H  -3.816191 -0.087543 1.906417
H  -3.164571 -1.519811 2.710407
H  -3.463346 -1.548357 0.971451
H  1.303106 5.85903 1.274155
H  0.965996 6.021831 -0.450999
H  -1.132988 5.394214 1.698288
H  -1.465853 5.628873 -0.02417
H  -0.875119 6.969923 0.952024
totalener: -1664.17905963 hartree
nucrepener: 3120.82749902 hartree
electener: -4785.00655865 hartree
oneelecener: -8484.53534679 hartree
twoeener: 3699.52878814 hartree
kineticenergy: 1657.99653194 hartree
xcener: -140.805536695253 hartree
chargesum: 0.0000000
charge: 0.034548 -0.334266 -0.320108 -0.375550 -0.259848 -0.383744 -0.126575 -0.174385 0.318128 -0.155690 -0.078643 0.319272 -0.284095 -0.291600 -0.155914 0.086026 -0.110235 -0.176413 0.041740 -0.154898 -0.255526 -0.246292 -0.118600 0.423535 0.340413 -0.173561 0.031446 -0.254188 0.089973 0.080380 0.093368 0.092968 0.088781 0.083790 0.092385 0.114698 0.117516 0.119378 0.120408 0.051173 0.105125 0.119669 0.092205 0.080835 0.087249 0.085580 0.085536 0.084543 0.092979 0.099543 0.093304 0.118544 0.099557 0.095594 0.085536 0.086375 0.093415 0.084617
qa: 0.0345 -0.3343 -0.3201 -0.3755 -0.2598 -0.3837 -0.1266 -0.1744 0.3181 -0.1557 -0.0786 0.3193 -0.2841 -0.2916 -0.1559 0.0860 -0.1102 -0.1764 0.0417 -0.1549 -0.2555 -0.2463 -0.1186 0.4235 0.3404 -0.1736 0.0314 -0.2542 0.0900 0.0804 0.0934 0.0930 0.0888 0.0838 0.0924 0.1147 0.1175 0.1194 0.1204 0.0512 0.1051 0.1197 0.0922 0.0808 0.0872 0.0856 0.0855 0.0845 0.0930 0.0995 0.0933 0.1185 0.0996 0.0956 0.0855 0.0864 0.0934 0.0846
va: 2.3754 2.0913 2.0659 2.1421 2.1328 2.1083 2.9848 3.1516 3.8390 3.9982 3.7196 3.8821 3.9285 3.9720 4.0119 3.8487 3.9336 4.0719 3.9682 3.9591 3.8941 3.9354 3.8483 4.3080 4.2215 3.9073 3.8864 3.9133 1.0030 1.0048 1.0090 1.0070 1.0098 1.0063 1.0140 1.0035 1.0053 1.0013 1.0066 1.0080 1.0175 1.0040 1.0096 1.0050 1.0128 1.0131 1.0152 1.0075 1.0179 1.0448 1.0105 1.0029 0.9900 0.9957 1.0118 1.0055 1.0120 1.0114
dispcorr: -0.034564568 hartree
energy: -1664.213624200162
dipole: -12.49258 12.63620 0.14362 3.07203 -3.32546 -0.25343 -18.69848 18.10803 -0.59044
magnitude: 0.65839 au
magnitude: 1.67350 debye
