program: Orca
programVersion: 5.0.3
elementType: S O O O O O N N C C C C C C C C C C C C C C C C C C C C H H H H H H H H H H H H H H H H H H H H H H H H H H H H H H
charge: 0
multiplicity: 1
keywords: wb97x-d3
keywords: def2-TZVPP
keywords: def2/J RIJCOSX
keywords: DEFGRID2
keywords: scfconv7
keywords: smallprint printgap noloewdin
keywords: NOSOSCF
formula: C20H30N2O5S
InChI: InChI=1/C20H30N2O5S/c1-7-25-17(23)11-12-22(14(2)3)28-21(6)19(24)26-16-10-8-9-15-13-20(4,5)27-18(15)16/h8-10,14H,7,11-13H2,1-6H3
58 atoms
S  -1.434534 1.313706 1.327071
O  0.705669 -2.226886 -0.977238
O  0.55387 -0.706879 1.427124
O  -0.814358 -2.463008 1.768841
O  0.63618 4.172573 0.476935
O  0.148418 4.134621 -1.706681
N  -1.512781 1.535913 -0.312678
N  -1.654838 -0.353856 1.670943
C  0.944236 -3.341467 -1.87561
C  2.432634 -3.707363 -1.65925
C  2.706628 -3.108948 -0.311811
C  1.646826 -2.267535 -0.020273
C  0.639158 -2.87503 -3.283643
C  0.027921 -4.47539 -1.439835
C  3.760179 -3.234367 0.572456
C  1.598745 -1.55611 1.164254
C  3.728142 -2.508435 1.759074
C  2.651991 -1.681228 2.054645
C  -2.806671 1.415227 -0.993583
C  -0.32032 1.28146 -1.114071
C  -2.959373 0.092645 -1.741692
C  -3.056108 2.608632 -1.907393
C  0.865084 2.111382 -0.644563
C  -0.653044 -1.282945 1.627907
C  0.511201 3.576061 -0.705663
C  -2.99659 -0.863496 1.910787
C  0.243703 5.541935 0.578966
C  -1.25549 5.688558 0.734548
H  2.587815 -4.78687 -1.696021
H  3.073896 -3.260817 -2.426017
H  -0.406352 -2.581836 -3.385885
H  0.830174 -3.67937 -3.994616
H  1.262386 -2.024707 -3.562013
H  0.156189 -5.341546 -2.090697
H  -1.016768 -4.168201 -1.48445
H  0.240023 -4.784501 -0.415433
H  4.596252 -3.884882 0.350322
H  4.540072 -2.595303 2.467591
H  2.622604 -1.128908 2.984733
H  -3.558181 1.445119 -0.201513
H  -0.049909 0.223177 -1.133069
H  -0.547424 1.564898 -2.142466
H  -2.743901 -0.762892 -1.100885
H  -3.978601 -0.014621 -2.114844
H  -2.293402 0.03601 -2.604618
H  -4.047604 2.537387 -2.356541
H  -2.332007 2.669039 -2.720324
H  -3.001372 3.541492 -1.348284
H  1.702867 1.928631 -1.322362
H  1.180211 1.816606 0.354712
H  -3.391698 -1.400905 1.046731
H  -3.647794 -0.020865 2.125485
H  -3.009147 -1.539177 2.76411
H  0.75841 5.911943 1.465346
H  0.603076 6.107841 -0.282292
H  -1.783715 5.367463 -0.16153
H  -1.504317 6.735507 0.911461
H  -1.622036 5.109048 1.581707
totalener: -1664.17838789 hartree
nucrepener: 3137.04515237 hartree
electener: -4801.22354026 hartree
oneelecener: -8516.90325409 hartree
twoeener: 3715.67971382 hartree
kineticenergy: 1657.99874462 hartree
xcener: -140.806486297678 hartree
chargesum: 0.0000000
charge: 0.033625 -0.335009 -0.321334 -0.377691 -0.258276 -0.380526 -0.125328 -0.167446 0.317506 -0.152136 -0.081739 0.305952 -0.284199 -0.293457 -0.160137 0.107997 -0.107930 -0.177891 0.043771 -0.156706 -0.257149 -0.253230 -0.113724 0.420688 0.334516 -0.171535 0.033119 -0.266329 0.089594 0.080608 0.091429 0.094084 0.089582 0.084678 0.091395 0.116133 0.117461 0.119288 0.120047 0.051110 0.099278 0.120329 0.084092 0.094705 0.079987 0.086025 0.088365 0.086614 0.094983 0.098441 0.097662 0.094293 0.118559 0.095750 0.087105 0.096336 0.088903 0.087761
qa: 0.0336 -0.3350 -0.3213 -0.3777 -0.2583 -0.3805 -0.1253 -0.1674 0.3175 -0.1521 -0.0817 0.3060 -0.2842 -0.2935 -0.1601 0.1080 -0.1079 -0.1779 0.0438 -0.1567 -0.2571 -0.2532 -0.1137 0.4207 0.3345 -0.1715 0.0331 -0.2663 0.0896 0.0806 0.0914 0.0941 0.0896 0.0847 0.0914 0.1161 0.1175 0.1193 0.1200 0.0511 0.0993 0.1203 0.0841 0.0947 0.0800 0.0860 0.0884 0.0866 0.0950 0.0984 0.0977 0.0943 0.1186 0.0958 0.0871 0.0963 0.0889 0.0878
va: 2.3749 2.0858 2.0702 2.1364 2.1325 2.1119 2.9789 3.1562 3.8370 3.9957 3.7206 3.8916 3.9287 3.9739 4.0119 3.8511 3.9310 4.0778 3.9665 3.9656 3.8979 3.9353 3.8502 4.3094 4.2260 3.9044 3.8798 3.9159 1.0035 1.0046 1.0088 1.0071 1.0097 1.0069 1.0132 1.0037 1.0053 1.0012 1.0063 1.0076 1.0237 1.0046 1.0142 1.0089 1.0052 1.0085 1.0127 1.0136 1.0188 1.0433 0.9885 1.0115 1.0048 0.9960 1.0120 1.0099 1.0125 1.0059
dispcorr: -0.035463251 hartree
energy: -1664.213851141408
dipole: -14.30561 14.28251 -0.02310 2.48988 -2.82824 -0.33835 -18.77006 18.21806 -0.55200
magnitude: 0.64786 au
magnitude: 1.64672 debye
