program: Orca
programVersion: 5.0.3
elementType: S O O O O O N N C C C C C C C C C C C C C C C C C C C C H H H H H H H H H H H H H H H H H H H H H H H H H H H H H H
charge: 0
multiplicity: 1
keywords: wb97x-d3
keywords: def2-TZVPP
keywords: def2/J RIJCOSX
keywords: DEFGRID2
keywords: scfconv7
keywords: smallprint printgap noloewdin
keywords: NOSOSCF
formula: C20H30N2O5S
InChI: InChI=1/C20H30N2O5S/c1-7-25-17(23)11-12-22(14(2)3)28-21(6)19(24)26-16-10-8-9-15-13-20(4,5)27-18(15)16/h8-10,14H,7,11-13H2,1-6H3
58 atoms
S  -1.385618 1.370805 1.290159
O  0.690044 -2.22574 -0.991779
O  0.589798 -0.664499 1.387822
O  -0.786652 -2.402911 1.78537
O  0.570863 4.143887 0.554894
O  0.232974 4.213354 -1.657037
N  -1.452359 1.574096 -0.353005
N  -1.614285 -0.291854 1.652562
C  0.893486 -3.368136 -1.86351
C  2.379325 -3.753228 -1.663249
C  2.685181 -3.127385 -0.335291
C  1.643787 -2.262266 -0.046979
C  0.571272 -2.935753 -3.278397
C  -0.03498 -4.472675 -1.381151
C  3.750055 -3.250297 0.535784
C  1.622636 -1.52842 1.124473
C  3.747789 -2.497809 1.706303
C  2.687955 -1.649407 2.001037
C  -2.738751 1.433346 -1.043487
C  -0.250374 1.321811 -1.140824
C  -2.885119 0.0858 -1.747583
C  -2.977611 2.593606 -2.002472
C  0.928532 2.153088 -0.653222
C  -0.618347 -1.227078 1.618895
C  0.544544 3.611077 -0.664409
C  -2.955322 -0.791746 1.916426
C  0.122065 5.491154 0.705728
C  -1.388654 5.57945 0.770033
H  2.516126 -4.835791 -1.676048
H  3.014635 -3.335984 -2.451228
H  0.734451 -3.763723 -3.968829
H  1.205028 -2.105811 -3.592551
H  -0.470491 -2.626186 -3.370432
H  0.067757 -5.359068 -2.008671
H  -1.075036 -4.148614 -1.417975
H  0.188412 -4.755928 -0.351752
H  4.572136 -3.919076 0.31573
H  4.569674 -2.581203 2.403841
H  2.680077 -1.078702 2.920446
H  -3.498177 1.492826 -0.260481
H  0.02188 0.263996 -1.160697
H  -0.465766 1.609551 -2.170652
H  -3.898599 -0.031734 -2.132963
H  -2.205083 -0.002223 -2.596816
H  -2.682123 -0.747187 -1.074139
H  -2.915848 3.547355 -1.480908
H  -3.969428 2.512293 -2.449067
H  -2.253952 2.616031 -2.817837
H  1.762817 2.004907 -1.342725
H  1.252117 1.831817 0.334931
H  -2.973442 -1.404576 2.816305
H  -3.33878 -1.391623 1.089208
H  -3.612576 0.060735 2.064237
H  0.564659 5.826848 1.643203
H  0.514615 6.117305 -0.09748
H  -1.846128 5.296886 -0.176502
H  -1.685297 6.605584 0.990349
H  -1.788643 4.938433 1.555649
totalener: -1664.17781602 hartree
nucrepener: 3144.74846615 hartree
electener: -4808.92628217 hartree
oneelecener: -8532.29504158 hartree
twoeener: 3723.36875941 hartree
kineticenergy: 1657.99647127 hartree
xcener: -140.806333429964 hartree
chargesum: 0.0000000
charge: 0.031374 -0.335603 -0.321426 -0.377807 -0.258116 -0.377728 -0.121307 -0.166689 0.318291 -0.151470 -0.081067 0.302840 -0.284122 -0.294146 -0.161534 0.112307 -0.105878 -0.180160 0.042427 -0.163380 -0.256129 -0.255707 -0.111953 0.420693 0.331688 -0.169685 0.033104 -0.271527 0.089742 0.080571 0.093985 0.089701 0.091048 0.084878 0.091159 0.116283 0.117368 0.119420 0.120079 0.051469 0.098703 0.121134 0.094148 0.079416 0.083841 0.091026 0.086584 0.087365 0.096268 0.099681 0.118419 0.098164 0.092407 0.095318 0.088098 0.098295 0.091129 0.087008
qa: 0.0314 -0.3356 -0.3214 -0.3778 -0.2581 -0.3777 -0.1213 -0.1667 0.3183 -0.1515 -0.0811 0.3028 -0.2841 -0.2941 -0.1615 0.1123 -0.1059 -0.1802 0.0424 -0.1634 -0.2561 -0.2557 -0.1120 0.4207 0.3317 -0.1697 0.0331 -0.2715 0.0897 0.0806 0.0940 0.0897 0.0910 0.0849 0.0912 0.1163 0.1174 0.1194 0.1201 0.0515 0.0987 0.1211 0.0941 0.0794 0.0838 0.0910 0.0866 0.0874 0.0963 0.0997 0.1184 0.0982 0.0924 0.0953 0.0881 0.0983 0.0911 0.0870
va: 2.3790 2.0863 2.0696 2.1370 2.1313 2.1156 2.9785 3.1586 3.8357 3.9951 3.7194 3.8939 3.9279 3.9739 4.0132 3.8485 3.9286 4.0807 3.9677 3.9707 3.9005 3.9358 3.8434 4.3095 4.2316 3.9038 3.8774 3.9164 1.0035 1.0046 1.0072 1.0098 1.0088 1.0071 1.0131 1.0039 1.0054 1.0011 1.0063 1.0076 1.0228 1.0038 1.0092 1.0043 1.0145 1.0126 1.0080 1.0118 1.0192 1.0425 1.0033 0.9898 1.0123 0.9963 1.0118 1.0084 1.0129 1.0069
dispcorr: -0.035767032 hartree
energy: -1664.213583047916
dipole: -14.80360 14.71369 -0.08991 1.77538 -2.18739 -0.41201 -18.58386 18.04837 -0.53549
magnitude: 0.68161 au
magnitude: 1.73250 debye
