program: Orca
programVersion: 5.0.3
elementType: S O O O O O N N C C C C C C C C C C C C C C C C C C C C H H H H H H H H H H H H H H H H H H H H H H H H H H H H H H
charge: 0
multiplicity: 1
keywords: wb97x-d3
keywords: def2-TZVPP
keywords: def2/J RIJCOSX
keywords: DEFGRID2
keywords: scfconv7
keywords: smallprint printgap noloewdin
keywords: NOSOSCF
formula: C20H30N2O5S
InChI: InChI=1/C20H30N2O5S/c1-7-25-17(23)11-12-22(14(2)3)28-21(6)19(24)26-16-10-8-9-15-13-20(4,5)27-18(15)16/h8-10,14H,7,11-13H2,1-6H3
58 atoms
S  -1.380886 1.35256 1.305091
O  0.690498 -2.232268 -1.006037
O  0.609835 -0.667862 1.373186
O  -0.74889 -2.418403 1.77781
O  0.544369 4.120273 0.583186
O  0.192554 4.219469 -1.625789
N  -1.465124 1.559037 -0.336687
N  -1.593373 -0.312681 1.666234
C  0.884867 -3.381429 -1.870786
C  2.375929 -3.756529 -1.691622
C  2.697795 -3.122014 -0.371398
C  1.656126 -2.260476 -0.073193
C  0.534609 -2.963972 -3.283307
C  -0.028135 -4.487085 -1.362072
C  3.773536 -3.237609 0.487129
C  1.645451 -1.52444 1.096793
C  3.782191 -2.481473 1.655395
C  2.721923 -1.637598 1.960737
C  -2.756946 1.411153 -1.015588
C  -0.269224 1.317904 -1.137259
C  -2.899569 0.064905 -1.722596
C  -3.013522 2.573051 -1.967958
C  0.910988 2.150933 -0.655282
C  -0.591389 -1.240516 1.615315
C  0.515463 3.605699 -0.644036
C  -2.927275 -0.82141 1.947715
C  0.071707 5.455848 0.760625
C  -1.439739 5.511235 0.843403
H  2.51935 -4.838279 -1.700542
H  2.996184 -3.33951 -2.491575
H  0.688831 -3.797229 -3.969344
H  1.157762 -2.133512 -3.616494
H  -0.510377 -2.660627 -3.358021
H  -1.070669 -4.169921 -1.385059
H  0.213376 -4.758766 -0.333625
H  0.070095 -5.379011 -1.982446
H  4.595387 -3.904201 0.25973
H  4.61259 -2.559598 2.343374
H  2.721468 -1.064594 2.878762
H  -3.509343 1.46222 -0.22526
H  0.007702 0.261499 -1.167493
H  -0.495943 1.612364 -2.162749
H  -2.688676 -0.76867 -1.052279
H  -3.914331 -0.057101 -2.103162
H  -2.223288 -0.017342 -2.575324
H  -2.29722 2.60521 -2.78945
H  -2.955653 3.525241 -1.443168
H  -4.008367 2.485114 -2.406467
H  1.736813 2.015918 -1.357493
H  1.249314 1.820881 0.324931
H  -3.58067 0.024784 2.140979
H  -2.921161 -1.463566 2.826637
H  -3.332782 -1.394091 1.111809
H  0.5181 5.785246 1.698479
H  0.442186 6.102628 -0.036534
H  -1.817014 4.848141 1.6219
H  -1.901969 5.234972 -0.102656
H  -1.75584 6.526685 1.084738
totalener: -1664.17767921 hartree
nucrepener: 3146.79270176 hartree
electener: -4810.97038097 hartree
oneelecener: -8536.38424226 hartree
twoeener: 3725.41386129 hartree
kineticenergy: 1658.00068563 hartree
xcener: -140.807297029428 hartree
chargesum: -0.0000000
charge: 0.030915 -0.336009 -0.321443 -0.378613 -0.258208 -0.376973 -0.120495 -0.165998 0.319228 -0.151346 -0.079840 0.300085 -0.283991 -0.294401 -0.162252 0.114320 -0.104964 -0.181561 0.043063 -0.165429 -0.256769 -0.256287 -0.111059 0.421172 0.330853 -0.169493 0.033405 -0.272815 0.089733 0.080469 0.093765 0.089756 0.091072 0.091046 0.116263 0.084917 0.117323 0.119486 0.120116 0.051457 0.098910 0.121452 0.083936 0.094056 0.079652 0.087410 0.092043 0.086518 0.096371 0.099749 0.093023 0.118365 0.097430 0.095299 0.088210 0.086598 0.098789 0.091693
qa: 0.0309 -0.3360 -0.3214 -0.3786 -0.2582 -0.3770 -0.1205 -0.1660 0.3192 -0.1513 -0.0798 0.3001 -0.2840 -0.2944 -0.1623 0.1143 -0.1050 -0.1816 0.0431 -0.1654 -0.2568 -0.2563 -0.1111 0.4212 0.3309 -0.1695 0.0334 -0.2728 0.0897 0.0805 0.0938 0.0898 0.0911 0.0910 0.1163 0.0849 0.1173 0.1195 0.1201 0.0515 0.0989 0.1215 0.0839 0.0941 0.0797 0.0874 0.0920 0.0865 0.0964 0.0997 0.0930 0.1184 0.0974 0.0953 0.0882 0.0866 0.0988 0.0917
va: 2.3797 2.0867 2.0694 2.1357 2.1309 2.1166 2.9782 3.1600 3.8359 3.9942 3.7172 3.8956 3.9270 3.9736 4.0139 3.8470 3.9273 4.0818 3.9663 3.9722 3.9018 3.9356 3.8413 4.3086 4.2333 3.9037 3.8763 3.9166 1.0035 1.0047 1.0073 1.0098 1.0087 1.0133 1.0041 1.0072 1.0055 1.0011 1.0064 1.0080 1.0221 1.0036 1.0145 1.0092 1.0042 1.0117 1.0121 1.0080 1.0191 1.0427 1.0123 1.0040 0.9892 0.9963 1.0119 1.0072 1.0078 1.0132
dispcorr: -0.035834032 hartree
energy: -1664.213513242462
dipole: -15.12594 15.01736 -0.10858 1.53645 -1.96630 -0.42986 -18.25134 17.73002 -0.52132
magnitude: 0.68436 au
magnitude: 1.73950 debye
