program: Orca
programVersion: 5.0.3
elementType: S O O O O O N N C C C C C C C C C C C C C C C C C C C C H H H H H H H H H H H H H H H H H H H H H H H H H H H H H H
charge: 0
multiplicity: 1
keywords: wb97x-d3
keywords: def2-TZVPP
keywords: def2/J RIJCOSX
keywords: DEFGRID2
keywords: scfconv7
keywords: smallprint printgap noloewdin
keywords: NOSOSCF
formula: C20H30N2O5S
InChI: InChI=1/C20H30N2O5S/c1-7-25-17(23)11-12-22(14(2)3)28-21(6)19(24)26-16-10-8-9-15-13-20(4,5)27-18(15)16/h8-10,14H,7,11-13H2,1-6H3
58 atoms
S  -2.726827 0.860962 1.546639
O  0.719938 -1.348435 -0.850448
O  -0.165101 -0.331147 1.659428
O  -0.823405 -2.485548 1.661587
O  1.598096 3.287905 -0.066223
O  1.053589 1.971927 -1.792627
N  -2.778592 1.3236 -0.045872
N  -2.362806 -0.81381 1.642571
C  1.457558 -2.056012 -1.88204
C  2.947516 -1.855329 -1.511763
C  2.865049 -1.44966 -0.071029
C  1.537689 -1.154009 0.190376
C  1.083898 -1.443711 -3.216081
C  1.061949 -3.522031 -1.792168
C  3.82209 -1.294148 0.912634
C  1.138941 -0.692112 1.431924
C  3.428587 -0.831021 2.164284
C  2.096318 -0.532569 2.420119
C  -3.94795 0.949671 -0.850919
C  -1.516861 1.466543 -0.76904
C  -3.718161 -0.29422 -1.705668
C  -4.418521 2.126127 -1.699733
C  -0.586232 2.459401 -0.095761
C  -1.089551 -1.316793 1.647621
C  0.761725 2.521821 -0.763633
C  -3.437589 -1.79337 1.696886
C  2.942939 3.416834 -0.531756
C  3.800938 2.241494 -0.115145
H  3.52677 -2.765873 -1.674942
H  3.406567 -1.064366 -2.113714
H  0.024422 -1.588323 -3.431754
H  1.653308 -1.916407 -4.017272
H  1.291248 -0.374221 -3.226685
H  1.576882 -4.102371 -2.559154
H  -0.011256 -3.644642 -1.938319
H  1.318312 -3.941779 -0.818301
H  4.861921 -1.520792 0.714763
H  4.160759 -0.70614 2.950074
H  1.790226 -0.172796 3.39376
H  -4.738315 0.728271 -0.130069
H  -1.018123 0.50447 -0.903816
H  -1.746906 1.8280 -1.772354
H  -3.348076 -1.129919 -1.112548
H  -4.650685 -0.606505 -2.177387
H  -2.997659 -0.110209 -2.504299
H  -5.347262 1.873671 -2.212657
H  -3.692565 2.397117 -2.467953
H  -4.600866 3.0034 -1.080385
H  -0.440267 2.206358 0.955696
H  -1.030553 3.459312 -0.101337
H  -3.485488 -2.397971 0.790301
H  -4.377673 -1.261608 1.813119
H  -3.311429 -2.465951 2.544246
H  2.960005 3.54797 -1.615344
H  3.305141 4.338169 -0.075854
H  3.781851 2.097191 0.964703
H  4.835105 2.419786 -0.41288
H  3.472045 1.315251 -0.582898
totalener: -1664.17978845 hartree
nucrepener: 3219.96023109 hartree
electener: -4884.14001955 hartree
oneelecener: -8682.99511237 hartree
twoeener: 3798.85509282 hartree
kineticenergy: 1657.98196947 hartree
xcener: -140.805565210715 hartree
chargesum: -0.0000000
charge: 0.032963 -0.322092 -0.320575 -0.370867 -0.270673 -0.391461 -0.119317 -0.182267 0.324957 -0.147663 -0.143562 0.383502 -0.291170 -0.290736 -0.133188 0.054347 -0.161640 -0.141530 0.050812 -0.143202 -0.256252 -0.259188 -0.131018 0.422851 0.358874 -0.174955 0.034750 -0.248459 0.093192 0.082506 0.083556 0.091858 0.110485 0.083219 0.090113 0.112985 0.112691 0.118109 0.118862 0.056200 0.105211 0.108489 0.090083 0.092233 0.082727 0.084806 0.074610 0.093069 0.103078 0.100034 0.100994 0.094708 0.118025 0.083856 0.095258 0.088955 0.085933 0.080911
qa: 0.0330 -0.3221 -0.3206 -0.3709 -0.2707 -0.3915 -0.1193 -0.1823 0.3250 -0.1477 -0.1436 0.3835 -0.2912 -0.2907 -0.1332 0.0543 -0.1616 -0.1415 0.0508 -0.1432 -0.2563 -0.2592 -0.1310 0.4229 0.3589 -0.1750 0.0347 -0.2485 0.0932 0.0825 0.0836 0.0919 0.1105 0.0832 0.0901 0.1130 0.1127 0.1181 0.1189 0.0562 0.1052 0.1085 0.0901 0.0922 0.0827 0.0848 0.0746 0.0931 0.1031 0.1000 0.1010 0.0947 0.1180 0.0839 0.0953 0.0890 0.0859 0.0809
va: 2.3636 2.0869 2.0633 2.1474 2.1414 2.0849 2.9908 3.1382 3.8264 4.0067 3.6873 3.7566 3.9311 3.9730 3.9470 3.8398 3.9226 4.0219 3.9507 3.9405 3.8964 3.9230 3.8379 4.3101 4.1875 3.9074 3.8924 3.9050 1.0041 1.0055 1.0094 1.0070 1.0142 1.0066 1.0143 1.0026 1.0067 1.0025 1.0051 1.0090 1.0110 1.0082 1.0131 1.0092 1.0032 1.0067 1.0109 1.0154 1.0436 1.0242 0.9889 1.0091 1.0033 1.0123 0.9952 1.0087 1.0119 1.0129
dispcorr: -0.038067035 hartree
energy: -1664.217855488848
dipole: -2.48303 2.64155 0.15852 -1.12088 1.46828 0.34740 -21.70967 20.96209 -0.74758
magnitude: 0.83946 au
magnitude: 2.13373 debye
