program: Orca
programVersion: 5.0.3
elementType: S O O O O O N N C C C C C C C C C C C C C C C C C C C C H H H H H H H H H H H H H H H H H H H H H H H H H H H H H H
charge: 0
multiplicity: 1
keywords: wb97x-d3
keywords: def2-TZVPP
keywords: def2/J RIJCOSX
keywords: DEFGRID2
keywords: scfconv7
keywords: smallprint printgap noloewdin
keywords: NOSOSCF
formula: C20H30N2O5S
InChI: InChI=1/C20H30N2O5S/c1-7-25-17(23)11-12-22(14(2)3)28-21(6)19(24)26-16-10-8-9-15-13-20(4,5)27-18(15)16/h8-10,14H,7,11-13H2,1-6H3
58 atoms
S  -2.702689 0.885524 1.519168
O  0.648553 -1.379549 -0.925672
O  -0.123302 -0.26993 1.582628
O  -0.751078 -2.43257 1.646829
O  1.733815 2.67034 0.064369
O  1.043655 1.869403 -1.903532
N  -2.796091 1.328585 -0.078232
N  -2.314567 -0.783149 1.627442
C  1.352371 -2.097313 -1.97383
C  2.851668 -1.820363 -1.704742
C  2.839125 -1.361031 -0.277962
C  1.518281 -1.110044 0.054226
C  0.870491 -1.554335 -3.303166
C  1.028386 -3.573784 -1.806174
C  3.846414 -1.122362 0.636839
C  1.174787 -0.606455 1.296104
C  3.508046 -0.622578 1.891018
C  2.181971 -0.365278 2.215529
C  -3.990892 0.953496 -0.844482
C  -1.551476 1.428459 -0.8362
C  -3.800837 -0.307947 -1.683338
C  -4.467423 2.122416 -1.699892
C  -0.580062 2.423012 -0.215616
C  -1.033878 -1.268229 1.614403
C  0.802136 2.27884 -0.797933
C  -3.373732 -1.776454 1.723708
C  3.100587 2.523514 -0.326653
C  3.96074 3.013496 0.813141
H  3.459457 -2.711732 -1.869853
H  3.236879 -1.034414 -2.361962
H  -0.195194 -1.742799 -3.440196
H  1.401595 -2.041409 -4.121789
H  1.040724 -0.480206 -3.370014
H  1.522266 -4.160464 -2.582173
H  -0.044942 -3.747861 -1.881463
H  1.360991 -3.945275 -0.835757
H  4.881352 -1.315769 0.385099
H  4.279885 -0.435765 2.624968
H  1.920212 0.028735 3.188785
H  -4.764006 0.754456 -0.098914
H  -1.078108 0.45096 -0.950858
H  -1.796086 1.759327 -1.845997
H  -3.431748 -1.140417 -1.085022
H  -4.74878 -0.611774 -2.128938
H  -3.095664 -0.149382 -2.500824
H  -4.623938 3.010779 -1.089364
H  -5.411098 1.874354 -2.186999
H  -3.756097 2.37302 -2.488446
H  -0.529203 2.300447 0.865323
H  -0.928997 3.445293 -0.392802
H  -3.432754 -2.39722 0.829158
H  -4.318329 -1.255963 1.851882
H  -3.218487 -2.432056 2.579205
H  3.306276 1.472242 -0.540446
H  3.292641 3.09285 -1.239482
H  3.781555 2.432127 1.716699
H  3.778551 4.065198 1.033523
H  5.012487 2.904191 0.548766
totalener: -1664.17957547 hartree
nucrepener: 3241.09623489 hartree
electener: -4905.27581036 hartree
oneelecener: -8725.15085893 hartree
twoeener: 3819.87504857 hartree
kineticenergy: 1657.98758076 hartree
xcener: -140.806354496353 hartree
chargesum: -0.0000000
charge: 0.033993 -0.323305 -0.316197 -0.369072 -0.259366 -0.385563 -0.122657 -0.181831 0.323095 -0.156811 -0.149410 0.401054 -0.293101 -0.289052 -0.111594 0.046961 -0.187665 -0.140817 0.052396 -0.150693 -0.257986 -0.258913 -0.111023 0.421382 0.331210 -0.176669 0.014000 -0.238285 0.092505 0.085302 0.084324 0.091980 0.111720 0.083385 0.091209 0.111586 0.114404 0.123351 0.118342 0.056034 0.105836 0.109905 0.091257 0.092048 0.082710 0.092888 0.084549 0.075074 0.103340 0.093109 0.101526 0.095602 0.118278 0.084847 0.106337 0.086486 0.090072 0.077911
qa: 0.0340 -0.3233 -0.3162 -0.3691 -0.2594 -0.3856 -0.1227 -0.1818 0.3231 -0.1568 -0.1494 0.4011 -0.2931 -0.2891 -0.1116 0.0470 -0.1877 -0.1408 0.0524 -0.1507 -0.2580 -0.2589 -0.1110 0.4214 0.3312 -0.1767 0.0140 -0.2383 0.0925 0.0853 0.0843 0.0920 0.1117 0.0834 0.0912 0.1116 0.1144 0.1234 0.1183 0.0560 0.1058 0.1099 0.0913 0.0920 0.0827 0.0929 0.0845 0.0751 0.1033 0.0931 0.1015 0.0956 0.1183 0.0848 0.1063 0.0865 0.0901 0.0779
va: 2.3683 2.0838 2.0702 2.1502 2.1262 2.1034 2.9974 3.1405 3.8333 4.0247 3.7235 3.7083 3.9271 3.9712 3.9166 3.8303 3.9067 3.9896 3.9520 3.9572 3.8959 3.9238 3.8161 4.3105 4.2022 3.9077 3.8646 3.9510 1.0029 1.0078 1.0091 1.0072 1.0139 1.0065 1.0144 1.0027 1.0057 1.0000 1.0064 1.0096 1.0123 1.0110 1.0124 1.0096 1.0033 1.0156 1.0067 1.0109 1.0506 1.0181 0.9884 1.0088 1.0034 0.9931 1.0068 1.0082 1.0082 1.0092
dispcorr: -0.038935016 hartree
energy: -1664.218510485402
dipole: -2.98542 3.09680 0.11138 -0.33417 0.53934 0.20518 -19.64912 18.98675 -0.66237
magnitude: 0.70231 au
magnitude: 1.78513 debye
