program: Orca
programVersion: 5.0.3
elementType: O O O O N C C C C C C C C C C C H H H H H H H H H H H H H
charge: 0
multiplicity: 1
keywords: wb97x-d3
keywords: def2-TZVPP
keywords: def2/J RIJCOSX
keywords: DEFGRID2
keywords: scfconv7
keywords: smallprint printgap noloewdin
keywords: NOSOSCF
formula: C11H13NO4
InChI: InChI=1/C11H13NO4/c1-11(2)15-8-6-4-5-7(9(8)16-11)14-10(13)12-3/h4-6,12H,1-3H3
29 atoms
O  0.735635 1.244629 0.004443
O  2.773251 0.319498 0.490256
O  -1.575603 -0.29598 -0.909824
O  -2.305387 -0.577852 1.215057
N  -3.636741 0.329658 -0.383991
C  2.126981 1.575638 0.213451
C  0.685884 -0.093072 -0.176957
C  1.91503 -0.660518 0.114029
C  2.248802 2.479922 1.411912
C  2.698503 2.166456 -1.056075
C  -0.372435 -0.873409 -0.571242
C  2.137201 -2.01313 0.03383
C  -0.180934 -2.252683 -0.655106
C  1.053601 -2.806075 -0.360716
C  -2.509493 -0.205817 0.077832
C  -4.773035 0.558853 0.478205
H  1.830598 2.013851 2.303813
H  3.295796 2.715995 1.598607
H  1.725105 3.417436 1.228444
H  3.75933 2.379143 -0.925708
H  2.584191 1.483813 -1.899526
H  2.195737 3.102539 -1.297459
H  3.100422 -2.446725 0.264294
H  -1.004324 -2.881646 -0.967351
H  1.18464 -3.876387 -0.438724
H  -3.679069 0.637295 -1.342642
H  -4.556764 1.292758 1.254267
H  -5.107527 -0.362598 0.952587
H  -5.587875 0.938717 -0.130026
elementType: O N C H
totalener: -782.76148696 hartree
nucrepener: 1137.89276456 hartree
electener: -1920.65425152 hartree
oneelecener: -3327.05242337 hartree
twoeener: 1406.39817184 hartree
cpcmener: -0.03460839 hartree
kineticenergy: 779.49782876 hartree
xcener: -73.385295087096 hartree
chargesum: 0.0000000
charge: -0.361432 -0.353941 -0.349155 -0.548055 -0.218008 0.464669 0.262717 0.154747 -0.258005 -0.294936 0.078024 -0.231808 -0.182664 -0.161846 0.534117 -0.163322 0.102611 0.103591 0.102475 0.106015 0.109788 0.104869 0.152965 0.155221 0.160393 0.189781 0.114256 0.110833 0.116100
qa: -0.3614 -0.3539 -0.3492 -0.5481 -0.2180 0.4647 0.2627 0.1547 -0.2580 -0.2949 0.0780 -0.2318 -0.1827 -0.1618 0.5341 -0.1633 0.1026 0.1036 0.1025 0.1060 0.1098 0.1049 0.1530 0.1552 0.1604 0.1898 0.1143 0.1108 0.1161
va: 2.0962 2.0999 2.0763 1.9565 3.2168 3.7934 3.8007 3.8428 3.9469 3.9980 3.8324 3.9755 3.9928 3.8984 4.2358 3.8990 1.0126 1.0064 1.0065 1.0070 1.0007 1.0071 1.0009 0.9937 0.9871 1.0051 0.9895 0.9919 0.9975
dispcorr: -0.011273265 hartree
energy: -782.772760226307
dipole: -0.44836 0.04284 -0.40553 7.98106 -6.83338 1.14769 0.45620 -1.82425 -1.36805
magnitude: 1.83118 au
magnitude: 4.65448 debye
