program: Orca
programVersion: 5.0.3
elementType: O O O O N C C C C C C C C C C C H H H H H H H H H H H H H
charge: 0
multiplicity: 1
keywords: wb97x-d3
keywords: def2-TZVPP
keywords: def2/J RIJCOSX
keywords: DEFGRID2
keywords: scfconv7
keywords: smallprint printgap noloewdin
keywords: NOSOSCF
formula: C11H13NO4
InChI: InChI=1/C11H13NO4/c1-11(2)15-8-6-4-5-7(9(8)16-11)14-10(13)12-3/h4-6,12H,1-3H3
29 atoms
O  0.772249 1.234868 -0.352441
O  2.825462 0.366272 0.188772
O  -1.602338 -0.374697 -0.81347
O  -2.30208 -0.501637 1.332233
N  -3.647557 0.30251 -0.322526
C  2.132019 1.60549 -0.044306
C  0.694256 -0.106632 -0.258553
C  1.930709 -0.638404 0.066481
C  2.14812 2.432814 1.220462
C  2.741181 2.301936 -1.238029
C  -0.39593 -0.918862 -0.44789
C  2.128858 -1.987956 0.225355
C  -0.225825 -2.295539 -0.291394
C  1.015236 -2.81402 0.035163
C  -2.521517 -0.208966 0.178681
C  -4.809694 0.602436 0.476483
H  3.172437 2.683817 1.49556
H  1.603539 3.365198 1.071213
H  1.689276 1.892479 2.049642
H  2.705661 1.667153 -2.124487
H  2.204677 3.226226 -1.453286
H  3.780994 2.557796 -1.036257
H  3.097765 -2.395316 0.480974
H  -1.072951 -2.95365 -0.436769
H  1.127455 -3.88348 0.151349
H  -3.684259 0.511856 -1.308288
H  -5.683871 0.075085 0.095548
H  -5.02289 1.671766 0.471087
H  -4.64853 0.293023 1.505003
elementType: O N C H
totalener: -782.76330303 hartree
nucrepener: 1136.69846696 hartree
electener: -1919.46176998 hartree
oneelecener: -3324.44121235 hartree
twoeener: 1404.97944236 hartree
cpcmener: -0.02712700 hartree
kineticenergy: 779.51723719 hartree
xcener: -73.388543460778 hartree
chargesum: -0.0000000
charge: -0.351697 -0.344868 -0.350026 -0.511741 -0.209764 0.472880 0.258153 0.158064 -0.278430 -0.274554 0.079551 -0.235329 -0.180076 -0.160479 0.495363 -0.141663 0.102745 0.101018 0.106400 0.103997 0.101563 0.102581 0.148163 0.149168 0.155036 0.179637 0.110839 0.110550 0.102919
qa: -0.3517 -0.3449 -0.3500 -0.5117 -0.2098 0.4729 0.2582 0.1581 -0.2784 -0.2746 0.0796 -0.2353 -0.1801 -0.1605 0.4954 -0.1417 0.1027 0.1010 0.1064 0.1040 0.1016 0.1026 0.1482 0.1492 0.1550 0.1796 0.1108 0.1105 0.1029
va: 2.1098 2.1163 2.0722 2.0054 3.2074 3.7828 3.8164 3.8494 3.9777 3.9744 3.8501 3.9789 3.9961 3.9052 4.2821 3.8788 1.0072 1.0072 1.0059 1.0074 1.0070 1.0069 1.0027 0.9948 0.9890 1.0086 0.9919 0.9911 1.0180
dispcorr: -0.011183435 hartree
energy: -782.774486462807
dipole: -0.78524 0.32524 -0.46000 8.17144 -7.12161 1.04983 0.83936 -1.93859 -1.09922
magnitude: 1.58809 au
magnitude: 4.03661 debye
