program: Orca
programVersion: 5.0.4
elementType: S S P O O O N N N C C C C C C C C C C H H H H H H H H H H H H
charge: 0
multiplicity: 1
keywords: wb97x-d3
keywords: def2-TZVPP
keywords: def2/J RIJCOSX
keywords: DEFGRID2
keywords: scfconv7
keywords: smallprint printgap noloewdin
keywords: NOSOSCF
formula: C10H12N3O3PS2
InChI: InChI=1/C10H12N3O3PS2/c1-15-17(18,16-2)19-7-13-10(14)8-5-3-4-6-9(8)11-12-13/h3-6H,7H2,1-2H3
31 atoms
S  -1.81888 -0.818509 1.483718
S  -3.611536 1.528464 0.02914
P  -2.110903 0.353324 -0.204668
O  -2.152439 -0.639784 -1.460588
O  -0.67479 1.027217 -0.397545
O  1.221267 -0.623709 2.506201
N  0.666872 -1.409246 0.456071
N  0.828885 -1.517738 -0.876826
N  1.754595 -0.923891 -1.458148
C  2.513717 0.052716 0.629251
C  -0.540632 -2.020633 0.944451
C  1.450226 -0.654799 1.311659
C  2.617824 -0.107462 -0.752378
C  3.395334 0.893653 1.308073
C  3.607151 0.572693 -1.464694
C  4.367555 1.565399 0.597772
C  4.471582 1.405181 -0.787911
C  -3.328084 -1.40438 -1.744367
C  -0.428553 1.930213 -1.48677
H  -0.932812 -2.666108 0.164439
H  -0.342592 -2.626748 1.827176
H  3.31248 1.018502 2.378945
H  3.678123 0.440097 -2.53592
H  5.053947 2.22261 1.113765
H  5.237879 1.940168 -1.332118
H  -3.111571 -1.988035 -2.634049
H  -4.181044 -0.754473 -1.936906
H  -3.566832 -2.080583 -0.923056
H  -1.200129 2.698638 -1.54135
H  -0.380332 1.3953 -2.433915
H  0.530386 2.400727 -1.287872
elementType: S P O N C H
totalener: -1916.11742580 hartree
nucrepener: 2003.00507083 hartree
electener: -3919.12249662 hartree
oneelecener: -6619.06728521 hartree
twoeener: 2699.94478858 hartree
cpcmener: -0.03596375 hartree
kineticenergy: 1910.85878931 hartree
xcener: -128.385404700280 hartree
chargesum: -0.0000000
charge: -0.138190 -0.435187 0.604181 -0.323867 -0.331749 -0.489897 0.056887 -0.117324 -0.138317 0.045977 -0.041808 0.342524 0.032290 -0.139777 -0.173789 -0.120208 -0.102069 -0.108181 -0.116070 0.156338 0.167452 0.151249 0.146535 0.167875 0.165967 0.131635 0.117907 0.114300 0.121053 0.129356 0.124906
qa: -0.1382 -0.4352 0.6042 -0.3239 -0.3317 -0.4899 0.0569 -0.1173 -0.1383 0.0460 -0.0418 0.3425 0.0323 -0.1398 -0.1738 -0.1202 -0.1021 -0.1082 -0.1161 0.1563 0.1675 0.1512 0.1465 0.1679 0.1660 0.1316 0.1179 0.1143 0.1211 0.1294 0.1249
va: 2.2846 2.0500 5.4555 2.0605 2.0827 2.0326 3.2413 2.8325 2.9754 3.4505 3.9058 4.2198 3.9940 3.9484 3.9989 3.9217 3.9231 3.8394 3.8284 1.0115 0.9973 1.0158 1.0161 0.9879 0.9865 0.9903 1.0034 0.9908 1.0055 0.9927 0.9869
dispcorr: -0.017588550 hartree
energy: -1916.135014345494
dipole: 5.80990 -3.72463 2.08528 1.35810 -1.85706 -0.49896 -8.42582 6.69479 -1.73103
magnitude: 2.75569 au
magnitude: 7.00440 debye
