program: Orca
programVersion: 5.0.4
elementType: S S P O O O N N N C C C C C C C C C C H H H H H H H H H H H H
charge: 0
multiplicity: 1
keywords: wb97x-d3
keywords: def2-TZVPP
keywords: def2/J RIJCOSX
keywords: DEFGRID2
keywords: scfconv7
keywords: smallprint printgap noloewdin
keywords: NOSOSCF
formula: C10H12N3O3PS2
InChI: InChI=1/C10H12N3O3PS2/c1-15-17(18,16-2)19-7-13-10(14)8-5-3-4-6-9(8)11-12-13/h3-6H,7H2,1-2H3
31 atoms
S  -1.822995 -1.953951 -0.50035
S  -3.481301 0.553868 -1.844368
P  -1.986686 0.107182 -0.725343
O  -0.526905 0.501472 -1.24008
O  -1.9644 0.740582 0.743744
O  0.388884 -0.084469 2.454788
N  0.619184 -1.438741 0.636659
N  1.262167 -1.860609 -0.468762
N  2.268949 -1.26631 -0.891564
C  2.143494 0.341792 0.919178
C  -0.619927 -2.138224 0.868487
C  0.988405 -0.366783 1.43369
C  2.737586 -0.136383 -0.247424
C  2.636403 1.488228 1.541037
C  3.833711 0.527529 -0.799497
C  3.716901 2.142552 0.987946
C  4.314156 1.661761 -0.181475
C  -0.133972 1.876654 -1.37296
C  -3.099088 0.626165 1.605215
H  -0.442524 -3.210353 0.939098
H  -1.056918 -1.802586 1.802043
H  2.171226 1.85967 2.443825
H  4.287178 0.145343 -1.70399
H  4.106509 3.0332 1.461536
H  5.16164 2.185092 -0.602766
H  0.800118 1.879931 -1.928025
H  0.025734 2.331486 -0.396559
H  -0.879128 2.448964 -1.926548
H  -3.959351 1.147857 1.186321
H  -2.821631 1.08521 2.549861
H  -3.36059 -0.419005 1.778928
elementType: S P O N C H
totalener: -1916.11567007 hartree
nucrepener: 2021.76611828 hartree
electener: -3937.88178835 hartree
oneelecener: -6656.29785787 hartree
twoeener: 2718.41606952 hartree
cpcmener: -0.03559873 hartree
kineticenergy: 1910.85997994 hartree
xcener: -128.387132647315 hartree
chargesum: 0.0000000
charge: -0.138000 -0.430890 0.604829 -0.336603 -0.317186 -0.496991 0.066825 -0.104881 -0.136670 0.018252 -0.033380 0.325132 0.059130 -0.142066 -0.182754 -0.115879 -0.102606 -0.115487 -0.114409 0.167386 0.148384 0.151372 0.145849 0.167571 0.166135 0.128860 0.125617 0.125980 0.121855 0.130366 0.114259
qa: -0.1380 -0.4309 0.6048 -0.3366 -0.3172 -0.4970 0.0668 -0.1049 -0.1367 0.0183 -0.0334 0.3251 0.0591 -0.1421 -0.1828 -0.1159 -0.1026 -0.1155 -0.1144 0.1674 0.1484 0.1514 0.1458 0.1676 0.1661 0.1289 0.1256 0.1260 0.1219 0.1304 0.1143
va: 2.2872 2.0563 5.4533 2.0759 2.0647 2.0140 3.2360 2.8275 2.9937 3.4172 3.9067 4.2229 3.9743 3.9323 4.0021 3.9217 3.9260 3.8326 3.8435 1.0002 1.0198 1.0168 1.0164 0.9876 0.9862 0.9859 0.9886 1.0064 1.0042 0.9911 0.9886
dispcorr: -0.018780719 hartree
energy: -1916.134450784108
dipole: 5.85487 -3.72257 2.13229 10.08781 -8.77621 1.31160 6.44553 -4.93168 1.51385
magnitude: 2.92553 au
magnitude: 7.43610 debye
