program: Orca
programVersion: 5.0.4
elementType: S S P O O O N N N C C C C C C C C C C H H H H H H H H H H H H
charge: 0
multiplicity: 1
keywords: wb97x-d3
keywords: def2-TZVPP
keywords: def2/J RIJCOSX
keywords: DEFGRID2
keywords: scfconv7
keywords: smallprint printgap noloewdin
keywords: NOSOSCF
formula: C10H12N3O3PS2
InChI: InChI=1/C10H12N3O3PS2/c1-15-17(18,16-2)19-7-13-10(14)8-5-3-4-6-9(8)11-12-13/h3-6H,7H2,1-2H3
31 atoms
S  -1.82894 -1.946567 -0.594627
S  -3.639652 0.636126 -1.527704
P  -2.138165 0.103833 -0.455453
O  -0.739034 0.805894 -0.807627
O  -2.200717 0.334099 1.120111
O  0.431129 -0.380476 2.416696
N  0.676831 -1.508399 0.453071
N  1.306119 -1.765474 -0.709498
N  2.288116 -1.092231 -1.070344
C  2.142158 0.284233 0.920359
C  -0.516622 -2.296164 0.636553
C  1.023045 -0.522311 1.362826
C  2.736801 -0.035702 -0.298917
C  2.60588 1.365724 1.668178
C  3.806671 0.722095 -0.77771
C  3.659336 2.114323 1.18696
C  4.258637 1.791581 -0.034798
C  -0.329977 0.967876 -2.169183
C  -2.180271 1.660413 1.67288
H  -0.289484 -3.352602 0.502261
H  -0.897214 -2.155055 1.641385
H  2.14122 1.614567 2.612413
H  4.260972 0.463864 -1.724779
H  4.02507 2.957324 1.757013
H  5.083284 2.388366 -0.400012
H  0.669732 1.392968 -2.14666
H  -0.998998 1.647048 -2.695707
H  -0.301926 0.012584 -2.694586
H  -2.397917 1.556957 2.731766
H  -2.942678 2.287819 1.210859
H  -1.202445 2.122605 1.548736
elementType: S P O N C H
totalener: -1916.11648587 hartree
nucrepener: 2018.45444451 hartree
electener: -3934.57093038 hartree
oneelecener: -6649.61682715 hartree
twoeener: 2715.04589677 hartree
cpcmener: -0.03337760 hartree
kineticenergy: 1910.84758284 hartree
xcener: -128.384943606897 hartree
chargesum: -0.0000000
charge: -0.138992 -0.430592 0.608645 -0.322056 -0.338718 -0.497456 0.072610 -0.110819 -0.141004 0.064609 -0.035021 0.317126 0.022394 -0.141330 -0.171440 -0.119594 -0.102455 -0.126240 -0.112875 0.167105 0.148634 0.152832 0.146766 0.167690 0.166292 0.129616 0.131084 0.121720 0.133800 0.118142 0.119530
qa: -0.1390 -0.4306 0.6086 -0.3221 -0.3387 -0.4975 0.0726 -0.1108 -0.1410 0.0646 -0.0350 0.3171 0.0224 -0.1413 -0.1714 -0.1196 -0.1025 -0.1262 -0.1129 0.1671 0.1486 0.1528 0.1468 0.1677 0.1663 0.1296 0.1311 0.1217 0.1338 0.1181 0.1195
va: 2.2873 2.0523 5.4424 2.0450 2.0812 2.0103 3.2366 2.8132 2.9676 3.4421 3.9007 4.2149 3.9890 3.9425 3.9996 3.9243 3.9225 3.8387 3.8360 0.9995 1.0270 1.0167 1.0158 0.9878 0.9862 0.9865 1.0059 0.9919 0.9873 1.0038 0.9911
dispcorr: -0.018635452 hartree
energy: -1916.135121317656
dipole: 9.02406 -6.11466 2.90940 10.32616 -8.93960 1.38656 2.85142 -2.26678 0.58465
magnitude: 3.27551 au
magnitude: 8.32569 debye
