program: Orca
programVersion: 5.0.4
elementType: S S P O O O N N N C C C C C C C C C C H H H H H H H H H H H H
charge: 0
multiplicity: 1
keywords: wb97x-d3
keywords: def2-TZVPP
keywords: def2/J RIJCOSX
keywords: DEFGRID2
keywords: scfconv7
keywords: smallprint printgap noloewdin
keywords: NOSOSCF
formula: C10H12N3O3PS2
InChI: InChI=1/C10H12N3O3PS2/c1-15-17(18,16-2)19-7-13-10(14)8-5-3-4-6-9(8)11-12-13/h3-6H,7H2,1-2H3
31 atoms
S  -1.818409 -0.561649 -1.741027
S  -3.702547 1.275906 0.216963
P  -2.170915 0.116651 0.1880
O  -0.801281 0.75844 0.724461
O  -2.218316 -1.237472 1.029796
O  1.233813 0.087712 -2.567612
N  0.682228 -1.28655 -0.853096
N  0.823695 -1.773675 0.395655
N  1.693631 -1.321997 1.161093
C  2.438028 0.258041 -0.524391
C  -0.472229 -1.793494 -1.545274
C  1.438549 -0.277674 -1.425087
C  2.515109 -0.286672 0.757712
C  3.272007 1.313574 -0.892548
C  3.433587 0.218267 1.67979
C  4.174281 1.809568 0.024466
C  4.253416 1.26207 1.309643
C  -0.416272 2.084961 0.35369
C  -2.27819 -1.19232 2.465875
H  -0.219629 -2.090554 -2.56173
H  -0.835109 -2.664071 -1.007637
H  3.206259 1.738678 -1.884771
H  3.484143 -0.213124 2.67064
H  4.824295 2.629589 -0.248937
H  4.96478 1.66284 2.018992
H  -1.137982 2.816406 0.716188
H  -0.317609 2.181724 -0.7277
H  0.548386 2.271475 0.818541
H  -1.29921 -0.963549 2.886285
H  -2.593217 -2.178595 2.796125
H  -3.005057 -0.45482 2.809625
elementType: S P O N C H
totalener: -1916.11758848 hartree
nucrepener: 2017.04280489 hartree
electener: -3933.16039337 hartree
oneelecener: -6646.74939456 hartree
twoeener: 2713.58900119 hartree
cpcmener: -0.03393183 hartree
kineticenergy: 1910.84695951 hartree
xcener: -128.384068933111 hartree
chargesum: -0.0000000
charge: -0.136956 -0.435423 0.607358 -0.323480 -0.337170 -0.488186 0.067072 -0.121339 -0.137837 -0.018569 -0.039000 0.330566 0.096955 -0.128167 -0.183870 -0.119941 -0.101030 -0.116563 -0.101112 0.165507 0.154194 0.150486 0.147596 0.167090 0.166155 0.132262 0.121614 0.124317 0.117439 0.129599 0.110431
qa: -0.1370 -0.4354 0.6074 -0.3235 -0.3372 -0.4882 0.0671 -0.1213 -0.1378 -0.0186 -0.0390 0.3306 0.0970 -0.1282 -0.1839 -0.1199 -0.1010 -0.1166 -0.1011 0.1655 0.1542 0.1505 0.1476 0.1671 0.1662 0.1323 0.1216 0.1243 0.1174 0.1296 0.1104
va: 2.2871 2.0484 5.4451 2.0466 2.0822 2.0298 3.2306 2.8296 2.9792 3.4478 3.9039 4.2013 3.9469 3.9282 4.0098 3.9237 3.9204 3.8352 3.8401 0.9963 1.0182 1.0170 1.0152 0.9880 0.9864 1.0081 0.9918 0.9864 0.9950 0.9889 1.0045
dispcorr: -0.018537942 hartree
energy: -1916.136126420585
dipole: 9.23367 -6.35515 2.87852 4.14342 -3.97193 0.17149 8.01293 -6.54948 1.46345
magnitude: 3.23373 au
magnitude: 8.21948 debye
