program: Orca
programVersion: 5.0.4
elementType: S S P O O O N N N C C C C C C C C C C H H H H H H H H H H H H
charge: 0
multiplicity: 1
keywords: wb97x-d3
keywords: def2-TZVPP
keywords: def2/J RIJCOSX
keywords: DEFGRID2
keywords: scfconv7
keywords: smallprint printgap noloewdin
keywords: NOSOSCF
formula: C10H12N3O3PS2
InChI: InChI=1/C10H12N3O3PS2/c1-15-17(18,16-2)19-7-13-10(14)8-5-3-4-6-9(8)11-12-13/h3-6H,7H2,1-2H3
31 atoms
S  -1.211531 -0.556469 -0.880891
S  -4.126174 0.614581 -1.758059
P  -3.027277 0.234612 -0.233675
O  -2.684074 1.424274 0.773117
O  -3.586212 -0.772282 0.874903
O  1.005955 1.456292 0.859837
N  1.054929 -0.787053 0.528339
N  1.668358 -1.944738 0.214371
N  2.892494 -1.979352 -0.000552
C  3.083392 0.41275 0.366673
C  -0.365408 -0.918107 0.714545
C  1.653865 0.460767 0.60776
C  3.651354 -0.826111 0.066874
C  3.880531 1.556151 0.416774
C  5.021405 -0.929605 -0.18186
C  5.232843 1.446573 0.17029
C  5.802054 0.204235 -0.128052
C  -2.215703 2.676461 0.260529
C  -4.147752 -2.025052 0.473016
H  -0.576108 -1.940263 1.014256
H  -0.704295 -0.237019 1.490519
H  3.4397 2.516836 0.646625
H  5.446766 -1.897094 -0.413994
H  5.859566 2.327462 0.206775
H  6.864607 0.134688 -0.319397
H  -1.832263 3.23574 1.109792
H  -3.032741 3.23203 -0.198634
H  -1.414846 2.545328 -0.468345
H  -3.435597 -2.617214 -0.104688
H  -5.0535 -1.876087 -0.114841
H  -4.39518 -2.560497 1.385918
elementType: S P O N C H
totalener: -1916.12300460 hartree
nucrepener: 1888.41182494 hartree
electener: -3804.53482953 hartree
oneelecener: -6389.44068246 hartree
twoeener: 2584.90585293 hartree
cpcmener: -0.02746440 hartree
kineticenergy: 1910.84490444 hartree
xcener: -128.379914709367 hartree
chargesum: -0.0000000
charge: -0.152791 -0.428474 0.626806 -0.327214 -0.331130 -0.472546 0.041221 -0.101667 -0.146021 0.004517 -0.024998 0.355398 0.079227 -0.141706 -0.181422 -0.122520 -0.097698 -0.125455 -0.113290 0.150700 0.142612 0.153657 0.146990 0.164185 0.163076 0.134314 0.129483 0.109707 0.112893 0.120989 0.131158
qa: -0.1528 -0.4285 0.6268 -0.3272 -0.3311 -0.4725 0.0412 -0.1017 -0.1460 0.0045 -0.0250 0.3554 0.0792 -0.1417 -0.1814 -0.1225 -0.0977 -0.1255 -0.1133 0.1507 0.1426 0.1537 0.1470 0.1642 0.1631 0.1343 0.1295 0.1097 0.1129 0.1210 0.1312
va: 2.2783 2.0434 5.4540 2.0948 2.0938 2.0534 3.2588 2.8244 2.9947 3.4913 3.9136 4.2114 4.0104 3.9492 4.0085 3.9299 3.9226 3.8390 3.8417 1.0120 1.0161 1.0153 1.0166 0.9895 0.9876 0.9905 1.0002 0.9976 0.9926 1.0006 0.9911
dispcorr: -0.014360421 hartree
energy: -1916.137365020032
dipole: 4.22945 -1.84998 2.37947 2.33449 -2.47762 -0.14313 4.42363 -3.30614 1.11748
magnitude: 2.63270 au
magnitude: 6.69180 debye
