program: Orca
programVersion: 5.0.4
elementType: S S P O O O N N N C C C C C C C C C C H H H H H H H H H H H H
charge: 0
multiplicity: 1
keywords: wb97x-d3
keywords: def2-TZVPP
keywords: def2/J RIJCOSX
keywords: DEFGRID2
keywords: scfconv7
keywords: smallprint printgap noloewdin
keywords: NOSOSCF
formula: C10H12N3O3PS2
InChI: InChI=1/C10H12N3O3PS2/c1-15-17(18,16-2)19-7-13-10(14)8-5-3-4-6-9(8)11-12-13/h3-6H,7H2,1-2H3
31 atoms
S  -1.6512 -1.88849 -0.537173
S  -3.466295 0.433778 -2.009435
P  -2.159302 0.126371 -0.637325
O  -0.726289 0.80898 -0.802478
O  -2.551707 0.600671 0.840075
O  0.347769 0.344894 2.172325
N  0.737859 -1.332094 0.682682
N  1.481202 -1.961697 -0.244055
N  2.566692 -1.490225 -0.626142
C  2.312397 0.420183 0.846574
C  -0.533703 -1.970715 0.909504
C  1.059062 -0.140645 1.316128
C  3.023815 -0.286973 -0.12203
C  2.793873 1.639465 1.321482
C  4.228746 0.215976 -0.615478
C  3.982254 2.134017 0.825555
C  4.699186 1.42124 -0.14069
C  -0.581984 2.23554 -0.784056
C  -3.843921 0.325853 1.384605
H  -0.382592 -3.035424 1.081089
H  -1.007128 -1.548477 1.789463
H  2.237671 2.188502 2.069352
H  4.769834 -0.346858 -1.364833
H  4.364071 3.079844 1.186229
H  5.630102 1.821715 -0.519514
H  -0.602301 2.612786 0.237598
H  -1.363426 2.723773 -1.368775
H  0.38209 2.458283 -1.233368
H  -4.633378 0.729873 0.749081
H  -3.883763 0.811135 2.358269
H  -3.998295 -0.747497 1.514929
elementType: S P O N C H
totalener: -1916.12213673 hartree
nucrepener: 1986.91659426 hartree
electener: -3903.03873098 hartree
oneelecener: -6586.79539363 hartree
twoeener: 2683.75666265 hartree
cpcmener: -0.02973117 hartree
kineticenergy: 1910.84793832 hartree
xcener: -128.383251758308 hartree
chargesum: -0.0000000
charge: -0.132076 -0.427607 0.604082 -0.330741 -0.318600 -0.464814 0.078915 -0.103300 -0.145789 0.009671 -0.041151 0.276590 0.095078 -0.144777 -0.183774 -0.119267 -0.096896 -0.115880 -0.106260 0.165018 0.149816 0.151716 0.145479 0.163468 0.162434 0.122175 0.123827 0.125374 0.114894 0.129366 0.113029
qa: -0.1321 -0.4276 0.6041 -0.3307 -0.3186 -0.4648 0.0789 -0.1033 -0.1458 0.0097 -0.0412 0.2766 0.0951 -0.1448 -0.1838 -0.1193 -0.0969 -0.1159 -0.1063 0.1650 0.1498 0.1517 0.1455 0.1635 0.1624 0.1222 0.1238 0.1254 0.1149 0.1294 0.1130
va: 2.2914 2.0540 5.4482 2.0755 2.0623 2.0530 3.2299 2.8245 3.0016 3.4311 3.9028 4.2781 3.9990 3.9299 4.0110 3.9266 3.9209 3.8268 3.8430 1.0019 1.0233 1.0180 1.0175 0.9893 0.9876 0.9954 1.0063 0.9877 1.0044 0.9898 0.9908
dispcorr: -0.017224103 hartree
energy: -1916.139360828755
dipole: 3.59111 -1.89602 1.69509 9.97396 -8.76623 1.20774 6.86236 -5.20391 1.65845
magnitude: 2.66128 au
magnitude: 6.76443 debye
