program: Orca
programVersion: 5.0.4
elementType: S S P O O O N N N C C C C C C C C C C H H H H H H H H H H H H
charge: 0
multiplicity: 1
keywords: wb97x-d3
keywords: def2-TZVPP
keywords: def2/J RIJCOSX
keywords: DEFGRID2
keywords: scfconv7
keywords: smallprint printgap noloewdin
keywords: NOSOSCF
formula: C10H12N3O3PS2
InChI: InChI=1/C10H12N3O3PS2/c1-15-17(18,16-2)19-7-13-10(14)8-5-3-4-6-9(8)11-12-13/h3-6H,7H2,1-2H3
31 atoms
S  -1.757925 -0.750168 -1.619489
S  -3.693894 1.458742 -0.127833
P  -2.155523 0.334349 0.105057
O  -0.750908 1.048574 0.369113
O  -2.195259 -0.715781 1.31328
O  1.335306 -0.443803 -2.481979
N  0.691326 -1.32702 -0.499827
N  0.79888 -1.509598 0.828567
N  1.703266 -0.954809 1.477711
C  2.556987 0.122034 -0.522597
C  -0.471644 -1.943192 -1.078184
C  1.514923 -0.537375 -1.285343
C  2.605189 -0.116075 0.850994
C  3.476228 0.985505 -1.118148
C  3.577066 0.505292 1.637799
C  4.430489 1.599248 -0.334703
C  4.480172 1.358565 1.042591
C  -0.547346 1.877831 1.520955
C  -3.373174 -1.478879 1.582515
H  -0.211721 -2.498266 -1.978883
H  -0.882197 -2.635936 -0.349327
H  3.435438 1.172085 -2.182865
H  3.602857 0.309989 2.701782
H  5.146073 2.272897 -0.78671
H  5.23469 1.847428 1.644445
H  -0.435794 1.275435 2.421868
H  -1.370275 2.581904 1.652963
H  0.368346 2.436776 1.345365
H  -3.120752 -2.164742 2.387844
H  -3.687406 -2.054323 0.70949
H  -4.191255 -0.832375 1.900874
elementType: S P O N C H
totalener: -1916.12130400 hartree
nucrepener: 1998.95851090 hartree
electener: -3915.07981489 hartree
oneelecener: -6610.87034180 hartree
twoeener: 2695.79052691 hartree
cpcmener: -0.03008970 hartree
kineticenergy: 1910.86049096 hartree
xcener: -128.384312147857 hartree
chargesum: -0.0000000
charge: -0.134739 -0.427537 0.596603 -0.327822 -0.317388 -0.458282 0.057242 -0.114218 -0.139910 0.035906 -0.043942 0.326021 0.037846 -0.138916 -0.176519 -0.120421 -0.101524 -0.118063 -0.112905 0.165273 0.153634 0.151383 0.145558 0.164651 0.163108 0.126328 0.121847 0.123532 0.129876 0.113877 0.119500
qa: -0.1347 -0.4275 0.5966 -0.3278 -0.3174 -0.4583 0.0572 -0.1142 -0.1399 0.0359 -0.0439 0.3260 0.0378 -0.1389 -0.1765 -0.1204 -0.1015 -0.1181 -0.1129 0.1653 0.1536 0.1514 0.1456 0.1647 0.1631 0.1263 0.1218 0.1235 0.1299 0.1139 0.1195
va: 2.2832 2.0561 5.4609 2.0824 2.0637 2.0718 3.2369 2.8323 2.9812 3.4578 3.9094 4.2401 3.9981 3.9506 4.0055 3.9245 3.9255 3.8329 3.8440 0.9976 1.0124 1.0157 1.0171 0.9892 0.9877 0.9930 1.0058 0.9872 0.9909 0.9915 1.0026
dispcorr: -0.017466699 hartree
energy: -1916.138770695150
dipole: 5.70835 -3.70253 2.00582 0.98834 -1.53580 -0.54746 8.93888 -7.23086 1.70802
magnitude: 2.69079 au
magnitude: 6.83944 debye
