program: Orca
programVersion: 5.0.4
elementType: S S P O O O N N N C C C C C C C C C C H H H H H H H H H H H H
charge: 0
multiplicity: 1
keywords: wb97x-d3
keywords: def2-TZVPP
keywords: def2/J RIJCOSX
keywords: DEFGRID2
keywords: scfconv7
keywords: smallprint printgap noloewdin
keywords: NOSOSCF
formula: C10H12N3O3PS2
InChI: InChI=1/C10H12N3O3PS2/c1-15-17(18,16-2)19-7-13-10(14)8-5-3-4-6-9(8)11-12-13/h3-6H,7H2,1-2H3
31 atoms
S  -2.087242 -1.472543 0.577209
S  -3.738101 1.17869 -0.377284
P  -2.002064 0.365478 -0.404686
O  -1.282711 0.119061 -1.804701
O  -0.796873 1.184106 0.25916
O  0.665034 -1.069283 2.254476
N  0.640817 -1.466324 0.026298
N  1.118006 -1.332604 -1.227943
N  2.076896 -0.579692 -1.467373
C  2.246709 0.044648 0.87126
C  -0.515786 -2.313945 0.114874
C  1.141664 -0.848971 1.159934
C  2.667546 0.15146 -0.454096
C  2.867472 0.796698 1.867715
C  3.714364 1.010556 -0.79243
C  3.896663 1.648732 1.525916
C  4.319485 1.754313 0.196913
C  -1.950087 -0.571348 -2.863158
C  -0.997855 1.843436 1.512488
H  -0.638962 -2.796215 -0.850311
H  -0.38077 -3.081278 0.875968
H  2.538571 0.714029 2.894844
H  4.030787 1.080335 -1.824817
H  4.381344 2.240848 2.290424
H  5.128406 2.426846 -0.055481
H  -1.229808 -0.66812 -3.671146
H  -2.812869 -0.004596 -3.213912
H  -2.275183 -1.566337 -2.554761
H  -1.665006 2.697103 1.396279
H  -0.0221 2.193026 1.839737
H  -1.405118 1.168812 2.266912
elementType: S P O N C H
totalener: -1916.11967073 hartree
nucrepener: 2023.75913359 hartree
electener: -3939.87880433 hartree
oneelecener: -6660.42262863 hartree
twoeener: 2720.54382430 hartree
cpcmener: -0.02835807 hartree
kineticenergy: 1910.86935612 hartree
xcener: -128.388222529831 hartree
chargesum: -0.0000000
charge: -0.144812 -0.421869 0.602406 -0.320937 -0.319495 -0.452586 0.062281 -0.100352 -0.143523 0.040053 -0.035427 0.267587 0.082293 -0.168184 -0.178960 -0.108329 -0.105047 -0.117995 -0.121463 0.150978 0.163044 0.153053 0.145762 0.164329 0.162666 0.131270 0.125952 0.112237 0.130114 0.127016 0.117937
qa: -0.1448 -0.4219 0.6024 -0.3209 -0.3195 -0.4526 0.0623 -0.1004 -0.1435 0.0401 -0.0354 0.2676 0.0823 -0.1682 -0.1790 -0.1083 -0.1050 -0.1180 -0.1215 0.1510 0.1630 0.1531 0.1458 0.1643 0.1627 0.1313 0.1260 0.1122 0.1301 0.1270 0.1179
va: 2.2721 2.0567 5.4822 2.1050 2.0881 2.0719 3.2302 2.8309 3.0029 3.3848 3.8940 4.2728 4.0129 3.9257 4.0065 3.9168 3.9284 3.8446 3.8328 1.0092 0.9997 1.0176 1.0170 0.9887 0.9877 0.9904 1.0027 0.9898 1.0049 0.9893 0.9962
dispcorr: -0.018383071 hartree
energy: -1916.138053805984
dipole: 7.35929 -5.07093 2.28836 3.63618 -3.66232 -0.02614 -0.37823 0.21370 -0.16453
magnitude: 2.29442 au
magnitude: 5.83195 debye
