program: Orca
programVersion: 5.0.4
elementType: S S P O O O N N N C C C C C C C C C C H H H H H H H H H H H H
charge: 0
multiplicity: 1
keywords: wb97x-d3
keywords: def2-TZVPP
keywords: def2/J RIJCOSX
keywords: DEFGRID2
keywords: scfconv7
keywords: smallprint printgap noloewdin
keywords: NOSOSCF
formula: C10H12N3O3PS2
InChI: InChI=1/C10H12N3O3PS2/c1-15-17(18,16-2)19-7-13-10(14)8-5-3-4-6-9(8)11-12-13/h3-6H,7H2,1-2H3
31 atoms
S  -1.852789 -1.00785 1.290719
S  -3.559857 1.508167 -0.0032
P  -2.069858 0.343261 -0.275108
O  -2.06942 -0.531663 -1.62561
O  -0.613288 1.002796 -0.359022
O  1.169561 -0.884219 2.459748
N  0.68561 -1.449066 0.317902
N  0.904123 -1.440371 -1.010857
N  1.832334 -0.773029 -1.498296
C  2.481621 0.035371 0.701322
C  -0.520453 -2.12619 0.703342
C  1.42342 -0.772492 1.285174
C  2.637262 0.00238 -0.682844
C  3.308655 0.837701 1.485326
C  3.631045 0.773017 -1.291166
C  4.283752 1.599196 0.877452
C  4.443589 1.5659 -0.511419
C  -3.250525 -1.225224 -2.006052
C  -0.381404 2.152662 -1.169929
H  -0.85585 -2.707088 -0.150536
H  -0.338498 -2.78647 1.550022
H  3.170452 0.85418 2.557685
H  3.738813 0.730534 -2.366401
H  4.929464 2.227153 1.476147
H  5.213333 2.167412 -0.976099
H  -3.548982 -1.949126 -1.243798
H  -3.021598 -1.75285 -2.928549
H  -4.07672 -0.53328 -2.173539
H  0.602789 2.527618 -0.899958
H  -1.129247 2.922985 -0.978796
H  -0.387826 1.890704 -2.228085
totalener: -1916.09715104 hartree
nucrepener: 2006.64147594 hartree
electener: -3922.73862698 hartree
oneelecener: -6625.66323373 hartree
twoeener: 2702.92460675 hartree
kineticenergy: 1910.92226257 hartree
xcener: -128.391727853631 hartree
chargesum: 0.0000000
charge: -0.101105 -0.366279 0.575816 -0.295095 -0.315191 -0.362799 0.033116 -0.090508 -0.105603 0.011170 -0.076627 0.295785 -0.023657 -0.119430 -0.156345 -0.098292 -0.084712 -0.131118 -0.132913 0.141755 0.152079 0.147943 0.133201 0.135216 0.135036 0.098330 0.123137 0.119303 0.104259 0.126274 0.127252
qa: -0.1011 -0.3663 0.5758 -0.2951 -0.3152 -0.3628 0.0331 -0.0905 -0.1056 0.0112 -0.0766 0.2958 -0.0237 -0.1194 -0.1563 -0.0983 -0.0847 -0.1311 -0.1329 0.1418 0.1521 0.1479 0.1332 0.1352 0.1350 0.0983 0.1231 0.1193 0.1043 0.1263 0.1273
va: 2.2876 2.1149 5.4567 2.0796 2.0985 2.1654 3.2097 2.8381 3.0241 3.4813 3.9572 4.2514 4.0616 3.9795 4.0171 3.9410 3.9507 3.8766 3.8548 1.0086 0.9998 1.0172 1.0238 1.0001 0.9978 0.9944 0.9889 1.0053 0.9885 1.0072 0.9887
dispcorr: -0.017541080 hartree
energy: -1916.114692118952
dipole: 5.79473 -4.44620 1.34852 2.80914 -2.88133 -0.07219 -7.44294 6.48301 -0.95993
magnitude: 1.65686 au
magnitude: 4.21140 debye
