program: Orca
programVersion: 5.0.4
elementType: S S P O O O N N N C C C C C C C C C C H H H H H H H H H H H H
charge: 0
multiplicity: 1
keywords: wb97x-d3
keywords: def2-TZVPP
keywords: def2/J RIJCOSX
keywords: DEFGRID2
keywords: scfconv7
keywords: smallprint printgap noloewdin
keywords: NOSOSCF
formula: C10H12N3O3PS2
InChI: InChI=1/C10H12N3O3PS2/c1-15-17(18,16-2)19-7-13-10(14)8-5-3-4-6-9(8)11-12-13/h3-6H,7H2,1-2H3
31 atoms
S  -1.716028 -1.90837 -0.692499
S  -3.621852 0.606378 -1.688779
P  -2.253007 0.088117 -0.462456
O  -0.876226 0.926367 -0.550394
O  -2.548585 0.172598 1.102655
O  0.435142 -0.065452 2.244066
N  0.742231 -1.413437 0.428779
N  1.43027 -1.833468 -0.648893
N  2.465911 -1.25148 -1.017101
C  2.267765 0.351719 0.798587
C  -0.48314 -2.144298 0.637395
C  1.074951 -0.343914 1.258271
C  2.919825 -0.138331 -0.330299
C  2.753046 1.479561 1.457947
C  4.06762 0.498985 -0.806714
C  3.884312 2.106199 0.98051
C  4.541119 1.614416 -0.151906
C  -0.285446 1.180143 -1.819496
C  -2.789797 1.434802 1.72196
H  -0.274761 -3.21307 0.628529
H  -0.901661 -1.868516 1.599473
H  2.235666 1.846283 2.333692
H  4.560646 0.10077 -1.682993
H  4.269116 2.982205 1.484815
H  5.429232 2.114269 -0.514635
H  0.601838 1.782569 -1.638156
H  -0.971065 1.723836 -2.470503
H  0.007766 0.250444 -2.312303
H  -3.451341 2.054152 1.113425
H  -1.851366 1.957468 1.899468
H  -3.272988 1.229749 2.67329
totalener: -1916.09919474 hartree
nucrepener: 2002.45633092 hartree
electener: -3918.55552566 hartree
oneelecener: -6617.08938324 hartree
twoeener: 2698.53385758 hartree
kineticenergy: 1910.90559418 hartree
xcener: -128.390403289716 hartree
chargesum: -0.0000000
charge: -0.102201 -0.358508 0.575286 -0.313388 -0.307529 -0.378928 0.059302 -0.094377 -0.108579 -0.013753 -0.071248 0.261502 0.013354 -0.112966 -0.156611 -0.103167 -0.082028 -0.152465 -0.110153 0.146457 0.153294 0.145877 0.135939 0.136577 0.136212 0.114806 0.133709 0.118146 0.106890 0.114008 0.114539
qa: -0.1022 -0.3585 0.5753 -0.3134 -0.3075 -0.3789 0.0593 -0.0944 -0.1086 -0.0138 -0.0712 0.2615 0.0134 -0.1130 -0.1566 -0.1032 -0.0820 -0.1525 -0.1102 0.1465 0.1533 0.1459 0.1359 0.1366 0.1362 0.1148 0.1337 0.1181 0.1069 0.1140 0.1145
va: 2.2919 2.1251 5.4577 2.0373 2.1099 2.1382 3.1835 2.8098 3.0126 3.4778 3.9193 4.2645 4.0503 3.9760 4.0335 3.9525 3.9506 3.8735 3.8651 1.0047 1.0258 1.0193 1.0227 0.9999 0.9978 0.9835 1.0121 0.9896 1.0071 0.9932 0.9919
dispcorr: -0.018080152 hartree
energy: -1916.117274892358
dipole: 8.19253 -6.36940 1.82312 10.29413 -9.32278 0.97135 3.93239 -3.19722 0.73518
magnitude: 2.19267 au
magnitude: 5.57332 debye
