program: Orca
programVersion: 5.0.4
elementType: S S P O O O N N N C C C C C C C C C C H H H H H H H H H H H H
charge: 0
multiplicity: 1
keywords: wb97x-d3
keywords: def2-TZVPP
keywords: def2/J RIJCOSX
keywords: DEFGRID2
keywords: scfconv7
keywords: smallprint printgap noloewdin
keywords: NOSOSCF
formula: C10H12N3O3PS2
InChI: InChI=1/C10H12N3O3PS2/c1-15-17(18,16-2)19-7-13-10(14)8-5-3-4-6-9(8)11-12-13/h3-6H,7H2,1-2H3
31 atoms
S  -1.971925 -1.350165 1.059235
S  -3.740455 1.208279 -0.060596
P  -2.1502 0.186562 -0.327934
O  -1.941701 -0.591699 -1.705815
O  -0.768947 1.021254 -0.256516
O  0.996124 -1.185023 2.372169
N  0.629414 -1.521979 0.160183
N  0.896081 -1.33935 -1.14739
N  1.79144 -0.557717 -1.511852
C  2.330084 -0.010791 0.793656
C  -0.546453 -2.310084 0.412985
C  1.294406 -0.932068 1.229409
C  2.522481 0.151662 -0.576368
C  3.092772 0.717788 1.705081
C  3.483015 1.051831 -1.043352
C  4.037008 1.60599 1.236935
C  4.229587 1.773214 -0.138552
C  -1.757794 0.132843 -2.921972
C  -0.577969 1.985626 0.772759
H  -0.819851 -2.800694 -0.515901
H  -0.352142 -3.054414 1.183388
H  2.930149 0.577855 2.765068
H  3.618908 1.163113 -2.110399
H  4.634335 2.176623 1.935081
H  4.974171 2.473128 -0.493204
H  -2.447293 0.976497 -2.988991
H  -1.966442 -0.558622 -3.733781
H  -0.731261 0.487279 -3.005439
H  0.396879 2.437038 0.602152
H  -0.585991 1.515733 1.758963
H  -1.351594 2.753629 0.737862
totalener: -1916.09819011 hartree
nucrepener: 2026.13665369 hartree
electener: -3942.23484380 hartree
oneelecener: -6664.46875351 hartree
twoeener: 2722.23390971 hartree
kineticenergy: 1910.92213634 hartree
xcener: -128.393360844151 hartree
chargesum: 0.0000000
charge: -0.101283 -0.357711 0.570887 -0.310298 -0.316892 -0.359950 0.051191 -0.109182 -0.108983 -0.071388 -0.062337 0.255467 0.083185 -0.115861 -0.163658 -0.099042 -0.082845 -0.108921 -0.138722 0.147819 0.149997 0.147505 0.133584 0.136719 0.135259 0.108359 0.114861 0.110284 0.107510 0.121140 0.133308
qa: -0.1013 -0.3577 0.5709 -0.3103 -0.3169 -0.3600 0.0512 -0.1092 -0.1090 -0.0714 -0.0623 0.2555 0.0832 -0.1159 -0.1637 -0.0990 -0.0828 -0.1089 -0.1387 0.1478 0.1500 0.1475 0.1336 0.1367 0.1353 0.1084 0.1149 0.1103 0.1075 0.1211 0.1333
va: 2.2889 2.1295 5.4595 2.1026 2.0379 2.1604 3.1972 2.8330 3.0021 3.4817 3.9333 4.2652 3.9938 3.9588 4.0376 3.9441 3.9493 3.8635 3.8668 1.0163 0.9962 1.0188 1.0225 0.9997 0.9980 1.0073 0.9923 0.9948 0.9846 0.9897 1.0129
dispcorr: -0.018780050 hartree
energy: -1916.116970163117
dipole: 10.02495 -8.02183 2.00312 7.46714 -6.92211 0.54503 -3.60439 3.09773 -0.50666
magnitude: 2.13687 au
magnitude: 5.43150 debye
