program: Orca
programVersion: 5.0.4
elementType: S S P O O O N N N C C C C C C C C C C H H H H H H H H H H H H
charge: 0
multiplicity: 1
keywords: wb97x-d3
keywords: def2-TZVPP
keywords: def2/J RIJCOSX
keywords: DEFGRID2
keywords: scfconv7
keywords: smallprint printgap noloewdin
keywords: NOSOSCF
formula: C10H12N3O3PS2
InChI: InChI=1/C10H12N3O3PS2/c1-15-17(18,16-2)19-7-13-10(14)8-5-3-4-6-9(8)11-12-13/h3-6H,7H2,1-2H3
31 atoms
S  -1.802807 -1.674524 0.937254
S  -0.69096 1.590908 0.74223
P  -2.126378 0.335563 0.504063
O  -3.386886 0.526096 1.478764
O  -2.738672 0.250182 -0.972887
O  0.275634 -0.280643 -2.233176
N  0.622532 -1.486647 -0.330957
N  1.347876 -1.857538 0.743333
N  2.445909 -1.330058 0.984592
C  2.250105 0.095845 -0.972631
C  -0.657302 -2.144405 -0.400913
C  0.971063 -0.525294 -1.273272
C  2.939197 -0.335855 0.157608
C  2.778141 1.10184 -1.778295
C  4.171265 0.233231 0.485242
C  3.993603 1.661757 -1.447973
C  4.689468 1.226245 -0.31609
C  -3.543703 1.663318 2.3200
C  -2.630202 1.322766 -1.905645
H  -1.105107 -1.951245 -1.370549
H  -0.520449 -3.217312 -0.276177
H  2.226841 1.430504 -2.64823
H  4.690783 -0.118969 1.365748
H  4.412943 2.444235 -2.065723
H  5.642946 1.673511 -0.068946
H  -2.618893 1.909044 2.841448
H  -4.312323 1.406599 3.044694
H  -3.866006 2.534676 1.749565
H  -2.852561 0.905364 -2.883734
H  -1.626708 1.744432 -1.914137
H  -3.35206 2.107602 -1.675554
totalener: -1916.09685844 hartree
nucrepener: 1990.68141225 hartree
electener: -3906.77827069 hartree
oneelecener: -6594.39717606 hartree
twoeener: 2687.61890536 hartree
kineticenergy: 1910.91731750 hartree
xcener: -128.393907377686 hartree
chargesum: 0.0000000
charge: -0.100320 -0.397520 0.627730 -0.332267 -0.308069 -0.395928 0.064021 -0.083296 -0.107788 -0.001491 -0.069743 0.206011 0.066497 -0.111655 -0.162178 -0.102297 -0.081613 -0.116197 -0.109061 0.152872 0.143307 0.142466 0.132667 0.133075 0.132947 0.110704 0.116889 0.106935 0.117571 0.111950 0.113780
qa: -0.1003 -0.3975 0.6277 -0.3323 -0.3081 -0.3959 0.0640 -0.0833 -0.1078 -0.0015 -0.0697 0.2060 0.0665 -0.1117 -0.1622 -0.1023 -0.0816 -0.1162 -0.1091 0.1529 0.1433 0.1425 0.1327 0.1331 0.1329 0.1107 0.1169 0.1069 0.1176 0.1119 0.1138
va: 2.3102 2.0368 5.3964 2.1148 2.0956 2.1151 3.1768 2.8291 3.0407 3.4816 3.9248 4.3355 4.0443 3.9765 4.0385 3.9573 3.9504 3.8740 3.8559 1.0242 1.0039 1.0194 1.0236 1.0003 0.9982 1.0059 0.9915 0.9881 0.9918 1.0067 0.9896
dispcorr: -0.016480460 hartree
energy: -1916.113338904284
dipole: -1.13034 1.27775 0.14741 9.46358 -8.70557 0.75802 -4.04055 3.55080 -0.48975
magnitude: 0.91443 au
magnitude: 2.32429 debye
