program: Orca
programVersion: 5.0.4
elementType: S S P O O O N N N C C C C C C C C C C H H H H H H H H H H H H
charge: 0
multiplicity: 1
keywords: wb97x-d3
keywords: def2-TZVPP
keywords: def2/J RIJCOSX
keywords: DEFGRID2
keywords: scfconv7
keywords: smallprint printgap noloewdin
keywords: NOSOSCF
formula: C10H12N3O3PS2
InChI: InChI=1/C10H12N3O3PS2/c1-15-17(18,16-2)19-7-13-10(14)8-5-3-4-6-9(8)11-12-13/h3-6H,7H2,1-2H3
31 atoms
S  -2.012686 -0.407986 -1.184302
S  -2.54608 -1.853655 1.858584
P  -2.304027 -0.227773 0.893758
O  -3.511856 0.832938 0.871643
O  -1.096037 0.665934 1.428939
O  0.761449 0.044932 -2.761743
N  0.589592 -1.076348 -0.797815
N  1.004134 -1.422431 0.436921
N  2.03017 -0.9185 0.925536
C  2.398707 0.414003 -1.075923
C  -0.677661 -1.646817 -1.179813
C  1.20996 -0.181611 -1.662414
C  2.755408 0.019641 0.212682
C  3.157785 1.36257 -1.760378
C  3.87874 0.58003 0.826556
C  4.262344 1.912375 -1.146792
C  4.621493 1.519639 0.147154
C  -4.859811 0.387666 0.765348
C  -0.793106 1.955125 0.906387
H  -0.629496 -2.038216 -2.193639
H  -0.914918 -2.446827 -0.480263
H  2.866982 1.654831 -2.760222
H  4.139038 0.261362 1.826784
H  4.857548 2.65034 -1.667471
H  5.491341 1.958874 0.617139
H  -5.042306 -0.106317 -0.191277
H  -5.488005 1.272622 0.832388
H  -5.110287 -0.30111 1.572638
H  -1.514983 2.696058 1.250706
H  -0.774051 1.954708 -0.185999
H  0.19484 2.217036 1.278093
totalener: -1916.09795467 hartree
nucrepener: 1974.81520623 hartree
electener: -3890.91316090 hartree
oneelecener: -6562.05645180 hartree
twoeener: 2671.14329090 hartree
kineticenergy: 1910.91363631 hartree
xcener: -128.390306994309 hartree
chargesum: -0.0000000
charge: -0.148244 -0.349701 0.617588 -0.335272 -0.299344 -0.371319 0.045658 -0.082655 -0.095208 -0.014998 -0.067001 0.261024 0.011297 -0.122517 -0.155093 -0.099689 -0.083634 -0.122424 -0.155576 0.150077 0.157930 0.147594 0.136444 0.136113 0.134602 0.106611 0.115356 0.115485 0.132979 0.111065 0.122852
qa: -0.1482 -0.3497 0.6176 -0.3353 -0.2993 -0.3713 0.0457 -0.0827 -0.0952 -0.0150 -0.0670 0.2610 0.0113 -0.1225 -0.1551 -0.0997 -0.0836 -0.1224 -0.1556 0.1501 0.1579 0.1476 0.1364 0.1361 0.1346 0.1066 0.1154 0.1155 0.1330 0.1111 0.1229
va: 2.2624 2.1270 5.4239 2.0850 2.1082 2.1483 3.1770 2.8322 3.0320 3.4868 3.9209 4.2607 4.0719 3.9738 4.0202 3.9451 3.9500 3.8836 3.8720 0.9993 1.0296 1.0182 1.0228 0.9998 0.9979 0.9905 0.9914 1.0033 0.9968 0.9965 0.9833
dispcorr: -0.016465068 hartree
energy: -1916.114419737340
dipole: 1.61004 -0.92716 0.68288 9.99552 -8.56883 1.42668 -0.98462 0.50579 -0.47883
magnitude: 1.65258 au
magnitude: 4.20052 debye
