program: Orca
programVersion: 5.0.4
elementType: S S P O O O N N N C C C C C C C C C C H H H H H H H H H H H H
charge: 0
multiplicity: 1
keywords: wb97x-d3
keywords: def2-TZVPP
keywords: def2/J RIJCOSX
keywords: DEFGRID2
keywords: scfconv7
keywords: smallprint printgap noloewdin
keywords: NOSOSCF
formula: C10H12N3O3PS2
InChI: InChI=1/C10H12N3O3PS2/c1-15-17(18,16-2)19-7-13-10(14)8-5-3-4-6-9(8)11-12-13/h3-6H,7H2,1-2H3
31 atoms
S  -1.876509 -1.636814 0.940343
S  -0.599295 1.549542 0.683737
P  -2.11576 0.388101 0.486312
O  -3.362092 0.711042 1.444656
O  -2.803064 0.332748 -0.951494
O  0.229414 -0.399087 -2.249319
N  0.584363 -1.509529 -0.291886
N  1.301579 -1.808444 0.810067
N  2.391782 -1.255903 1.02948
C  2.201438 0.050903 -1.009731
C  -0.688891 -2.176387 -0.33846
C  0.927132 -0.592293 -1.279707
C  2.884929 -0.308796 0.148588
C  2.72656 1.012653 -1.869157
C  4.109216 0.289509 0.451313
C  3.934961 1.601087 -1.564034
C  4.625283 1.238561 -0.403508
C  -3.165362 1.08291 2.804587
C  -2.706217 1.432214 -1.856915
H  -1.120778 -2.046184 -1.325496
H  -0.551639 -3.238438 -0.142195
H  2.178596 1.285593 -2.760165
H  4.624813 -0.004913 1.35515
H  4.352411 2.349715 -2.22383
H  5.572609 1.708438 -0.175744
H  -2.869482 0.223207 3.40852
H  -4.117823 1.45995 3.168034
H  -2.40626 1.859936 2.899277
H  -1.666499 1.685313 -2.055934
H  -3.226959 2.308615 -1.46999
H  -3.183919 1.108027 -2.777415
totalener: -1916.09762915 hartree
nucrepener: 1997.13357137 hartree
electener: -3913.23120052 hartree
oneelecener: -6607.25995648 hartree
twoeener: 2694.02875596 hartree
kineticenergy: 1910.92071698 hartree
xcener: -128.394110782360 hartree
chargesum: 0.0000000
charge: -0.125342 -0.393759 0.638633 -0.329575 -0.307955 -0.393225 0.058481 -0.085171 -0.102779 -0.010386 -0.055451 0.209641 0.067919 -0.107006 -0.163347 -0.103885 -0.080299 -0.122104 -0.112855 0.154285 0.141763 0.142151 0.132086 0.132989 0.132601 0.107078 0.115768 0.112303 0.113045 0.117646 0.116753
qa: -0.1253 -0.3938 0.6386 -0.3296 -0.3080 -0.3932 0.0585 -0.0852 -0.1028 -0.0104 -0.0555 0.2096 0.0679 -0.1070 -0.1633 -0.1039 -0.0803 -0.1221 -0.1129 0.1543 0.1418 0.1422 0.1321 0.1330 0.1326 0.1071 0.1158 0.1123 0.1130 0.1176 0.1168
va: 2.2924 2.0475 5.4192 2.1236 2.1086 2.1169 3.1846 2.8306 3.0350 3.4827 3.9259 4.3366 4.0373 3.9709 4.0423 3.9600 3.9488 3.8806 3.8618 1.0223 1.0022 1.0193 1.0237 1.0003 0.9981 0.9880 0.9900 1.0055 1.0009 0.9911 0.9924
dispcorr: -0.016491839 hartree
energy: -1916.114120988932
dipole: -0.23584 0.50295 0.26711 7.54525 -7.04465 0.50059 -2.45384 2.15920 -0.29464
magnitude: 0.63934 au
magnitude: 1.62506 debye
