program: Orca
programVersion: 5.0.4
elementType: S S P O O O N N N C C C C C C C C C C C C H H H H H H H H H H H H H H H H
charge: 0
multiplicity: 1
keywords: wb97x-d3
keywords: def2-TZVPP
keywords: def2/J RIJCOSX
keywords: DEFGRID2
keywords: scfconv7
keywords: smallprint printgap noloewdin
keywords: NOSOSCF
formula: C12H16N3O3PS2
InChI: InChI=1/C12H16N3O3PS2/c1-3-17-19(20,18-4-2)21-9-15-12(16)10-7-5-6-8-11(10)13-14-15/h5-8H,3-4,9H2,1-2H3
37 atoms
S  1.555048 1.482902 -1.594107
S  3.622106 0.925022 0.872104
P  2.014111 0.281893 0.037257
O  2.001383 -1.240224 -0.446654
O  0.667072 0.324591 0.896069
O  -0.950425 -1.652544 -1.244767
N  -1.038604 0.606463 -1.51499
N  -1.528908 1.829293 -1.235159
N  -2.430775 1.982134 -0.392527
C  0.12062 0.651576 -2.371137
C  -2.479042 -0.399302 0.062968
C  -1.440597 -0.583253 -0.930697
C  -2.930805 0.897088 0.303662
C  -2.984686 -1.468744 0.800657
C  -3.902115 1.1328 1.277427
C  3.108221 -1.86477 -1.125434
C  0.517468 -0.537695 2.053416
C  -3.938846 -1.228558 1.767203
C  -4.396668 0.07141 2.004193
C  3.005896 -3.352974 -0.916363
C  -0.350306 0.15958 3.066154
H  0.382067 -0.349608 -2.695046
H  -0.095299 1.249294 -3.254976
H  -2.629194 -2.473415 0.61749
H  -4.244341 2.143478 1.45475
H  3.054226 -1.607716 -2.184778
H  4.048668 -1.478619 -0.727574
H  0.067625 -1.474071 1.721757
H  1.496584 -0.764159 2.482367
H  -4.3367 -2.050408 2.346517
H  -5.144265 0.244632 2.766152
H  3.822417 -3.844051 -1.445115
H  3.085673 -3.612613 0.139194
H  2.06868 -3.750577 -1.305274
H  -1.333867 0.400379 2.662566
H  -0.494768 -0.501273 3.920784
H  0.115196 1.076723 3.42616
elementType: S P O N C H
totalener: -1994.76392106 hartree
nucrepener: 2336.68418148 hartree
electener: -4331.44810254 hartree
oneelecener: -7390.31894645 hartree
twoeener: 3058.87084391 hartree
cpcmener: -0.03675510 hartree
kineticenergy: 1989.07907232 hartree
xcener: -136.741501564451 hartree
chargesum: 0.0000000
charge: -0.138134 -0.440604 0.599175 -0.316744 -0.337004 -0.498385 0.074465 -0.108964 -0.137408 -0.036783 0.030601 0.300275 0.066366 -0.149402 -0.173457 0.041862 0.021341 -0.124617 -0.093864 -0.242111 -0.241048 0.149697 0.165830 0.152411 0.145757 0.102615 0.095716 0.110779 0.118035 0.166761 0.165859 0.090933 0.087249 0.089143 0.068519 0.100306 0.094831
qa: -0.1381 -0.4406 0.5992 -0.3167 -0.3370 -0.4984 0.0745 -0.1090 -0.1374 -0.0368 0.0306 0.3003 0.0664 -0.1494 -0.1735 0.0419 0.0213 -0.1246 -0.0939 -0.2421 -0.2410 0.1497 0.1658 0.1524 0.1458 0.1026 0.0957 0.1108 0.1180 0.1668 0.1659 0.0909 0.0872 0.0891 0.0685 0.1003 0.0948
va: 2.2972 2.0385 5.4599 2.0771 2.0677 2.0095 3.2368 2.8244 2.9938 3.9096 3.3867 4.2554 3.9790 3.9119 3.9933 3.8322 3.8076 3.9228 3.9131 3.9531 3.9541 1.0203 1.0014 1.0180 1.0168 0.9910 1.0113 0.9975 1.0089 0.9884 0.9864 1.0075 1.0055 1.0049 1.0072 1.0071 1.0111
dispcorr: -0.022822446 hartree
energy: -1994.786743508116
dipole: -1.97734 -0.12070 -2.09804 -16.55723 14.58241 -1.97482 9.13757 -8.66897 0.46860
magnitude: 2.91912 au
magnitude: 7.41981 debye
