program: Orca
programVersion: 5.0.4
elementType: S S P O O O N N N C C C C C C C C C C C C H H H H H H H H H H H H H H H H
charge: 0
multiplicity: 1
keywords: wb97x-d3
keywords: def2-TZVPP
keywords: def2/J RIJCOSX
keywords: DEFGRID2
keywords: scfconv7
keywords: smallprint printgap noloewdin
keywords: NOSOSCF
formula: C12H16N3O3PS2
InChI: InChI=1/C12H16N3O3PS2/c1-3-17-19(20,18-4-2)21-9-15-12(16)10-7-5-6-8-11(10)13-14-15/h5-8H,3-4,9H2,1-2H3
37 atoms
S  1.167989 1.029827 -1.577377
S  3.54863 -1.204248 -1.163452
P  2.184686 -0.204235 -0.247026
O  0.983205 -1.019255 0.417908
O  2.666923 0.697348 0.985082
O  -1.960882 1.313296 -2.122645
N  -1.079596 1.288951 -0.039025
N  -1.067423 0.946348 1.260945
N  -1.982268 0.254685 1.745123
C  0.088194 2.009627 -0.477096
C  -3.095684 0.119183 -0.407716
C  -2.044657 0.941697 -0.966478
C  -3.014966 -0.201735 0.947561
C  -4.148841 -0.362553 -1.18507
C  -3.990029 -1.01097 1.534192
C  1.248495 -1.994528 1.455085
C  3.984035 1.280829 1.056882
C  -5.106957 -1.161434 -0.599245
C  -5.025696 -1.485409 0.759544
C  0.071039 -2.928355 1.54418
C  4.188152 2.396424 0.062358
H  -0.198636 2.884554 -1.057608
H  0.633516 2.347362 0.399534
H  -4.207951 -0.113446 -2.23572
H  -3.916951 -1.255943 2.585167
H  2.159565 -2.546963 1.213728
H  1.407162 -1.46912 2.39758
H  4.06354 1.650288 2.07759
H  4.729877 0.495348 0.923643
H  -5.926983 -1.542096 -1.192546
H  -5.783819 -2.115238 1.20467
H  0.263863 -3.664532 2.324443
H  -0.846274 -2.40031 1.804638
H  -0.086713 -3.465231 0.608997
H  5.1547 2.862683 0.255321
H  4.198478 2.033748 -0.965416
H  3.421173 3.165442 0.155092
elementType: S P O N C H
totalener: -1994.76376442 hartree
nucrepener: 2278.32211644 hartree
electener: -4273.08588086 hartree
oneelecener: -7273.74950780 hartree
twoeener: 3000.66362694 hartree
cpcmener: -0.03510823 hartree
kineticenergy: 1989.08290852 hartree
xcener: -136.740938049449 hartree
chargesum: -0.0000000
charge: -0.135720 -0.443345 0.622369 -0.337792 -0.347326 -0.498490 0.073623 -0.112469 -0.152960 -0.055106 0.019179 0.353781 0.062223 -0.139613 -0.181329 0.018798 0.044563 -0.124654 -0.093253 -0.239892 -0.250984 0.170508 0.152395 0.151254 0.145950 0.101051 0.112395 0.111965 0.095955 0.167769 0.166698 0.096080 0.081379 0.088670 0.105497 0.075500 0.095330
qa: -0.1357 -0.4433 0.6224 -0.3378 -0.3473 -0.4985 0.0736 -0.1125 -0.1530 -0.0551 0.0192 0.3538 0.0622 -0.1396 -0.1813 0.0188 0.0446 -0.1247 -0.0933 -0.2399 -0.2510 0.1705 0.1524 0.1513 0.1459 0.1011 0.1124 0.1120 0.0960 0.1678 0.1667 0.0961 0.0814 0.0887 0.1055 0.0755 0.0953
va: 2.2771 2.0228 5.4263 2.0984 2.0614 2.0211 3.2496 2.8401 2.9623 3.8997 3.5081 4.2135 4.0001 3.9442 3.9870 3.8378 3.8296 3.9262 3.9120 3.9590 3.9088 0.9983 1.0242 1.0157 1.0170 1.0076 0.9970 0.9923 1.0136 0.9881 0.9861 1.0079 1.0035 1.0058 1.0123 1.0163 1.0019
dispcorr: -0.020217215 hartree
energy: -1994.783981631724
dipole: 3.04015 -4.52519 -1.48503 -3.00466 3.16495 0.16029 10.57126 -8.37113 2.20012
magnitude: 2.65924 au
magnitude: 6.75925 debye
