program: Orca
programVersion: 5.0.4
elementType: S S P O O O N N N C C C C C C C C C C C C H H H H H H H H H H H H H H H H
charge: 0
multiplicity: 1
keywords: wb97x-d3
keywords: def2-TZVPP
keywords: def2/J RIJCOSX
keywords: DEFGRID2
keywords: scfconv7
keywords: smallprint printgap noloewdin
keywords: NOSOSCF
formula: C12H16N3O3PS2
InChI: InChI=1/C12H16N3O3PS2/c1-3-17-19(20,18-4-2)21-9-15-12(16)10-7-5-6-8-11(10)13-14-15/h5-8H,3-4,9H2,1-2H3
37 atoms
S  1.30603 0.918138 1.255241
S  2.265159 1.511265 -1.972818
P  2.217691 0.253626 -0.52163
O  1.523367 -1.114896 -0.940799
O  3.615466 -0.241862 0.072747
O  -1.8122 0.679262 2.369894
N  -1.220625 1.058813 0.216425
N  -1.31388 0.856055 -1.111285
N  -2.205106 0.127507 -1.583862
C  -0.100692 1.876059 0.609639
C  -3.060241 -0.361796 0.633631
C  -2.015211 0.47489 1.18696
C  -3.110163 -0.504286 -0.752985
C  -3.981985 -1.02673 1.442022
C  -4.088705 -1.307381 -1.341546
C  1.427277 -2.273419 -0.075943
C  4.675474 0.682357 0.403255
C  -4.945643 -1.81817 0.854059
C  -4.998147 -1.957515 -0.537018
C  -0.005693 -2.529965 0.312781
C  5.938503 0.253247 -0.295935
H  0.21862 2.462822 -0.248954
H  -0.391686 2.557479 1.405427
H  -3.93939 -0.920634 2.517279
H  -4.117015 -1.407313 -2.418145
H  1.832553 -3.10262 -0.653938
H  2.051718 -2.155852 0.810585
H  4.40141 1.697581 0.109339
H  4.791849 0.665288 1.486353
H  -5.666469 -2.336618 1.471214
H  -5.760182 -2.581376 -0.98382
H  -0.37259 -1.780999 1.012398
H  -0.663448 -2.559467 -0.555956
H  -0.066462 -3.498845 0.808983
H  5.829717 0.307204 -1.378924
H  6.751337 0.918447 -0.004824
H  6.223797 -0.762179 -0.021783
elementType: S P O N C H
totalener: -1994.76360546 hartree
nucrepener: 2271.03095575 hartree
electener: -4265.79456121 hartree
oneelecener: -7259.17127026 hartree
twoeener: 2993.37670905 hartree
cpcmener: -0.03699703 hartree
kineticenergy: 1989.07571137 hartree
xcener: -136.740343448734 hartree
chargesum: -0.0000000
charge: -0.160063 -0.432203 0.630574 -0.341069 -0.352695 -0.498603 0.087262 -0.110165 -0.131758 -0.043899 0.025493 0.320598 0.044772 -0.133446 -0.173370 0.030466 0.035994 -0.124039 -0.101480 -0.241503 -0.232825 0.157326 0.163818 0.151751 0.146328 0.111368 0.098486 0.087815 0.111328 0.167383 0.166601 0.075404 0.093116 0.108860 0.080237 0.091876 0.090263
qa: -0.1601 -0.4322 0.6306 -0.3411 -0.3527 -0.4986 0.0873 -0.1102 -0.1318 -0.0439 0.0255 0.3206 0.0448 -0.1334 -0.1734 0.0305 0.0360 -0.1240 -0.1015 -0.2415 -0.2328 0.1573 0.1638 0.1518 0.1463 0.1114 0.0985 0.0878 0.1113 0.1674 0.1666 0.0754 0.0931 0.1089 0.0802 0.0919 0.0903
va: 2.2631 2.0307 5.4497 2.0957 2.0844 2.0140 3.2250 2.8311 2.9805 3.8694 3.4305 4.2065 3.9895 3.9389 4.0007 3.8725 3.8333 3.9284 3.9226 3.9173 3.9637 1.0315 1.0023 1.0168 1.0168 0.9966 0.9984 1.0110 0.9925 0.9883 0.9862 1.0046 1.0008 1.0103 1.0113 1.0074 1.0040
dispcorr: -0.020590085 hartree
energy: -1994.784195542686
dipole: 7.96987 -8.92543 -0.95555 -11.56668 9.89081 -1.67588 4.34552 -3.01275 1.33277
magnitude: 2.34476 au
magnitude: 5.95992 debye
