program: Orca
programVersion: 5.0.4
elementType: S S P O O O N N N C C C C C C C C C C C C H H H H H H H H H H H H H H H H
charge: 0
multiplicity: 1
keywords: wb97x-d3
keywords: def2-TZVPP
keywords: def2/J RIJCOSX
keywords: DEFGRID2
keywords: scfconv7
keywords: smallprint printgap noloewdin
keywords: NOSOSCF
formula: C12H16N3O3PS2
InChI: InChI=1/C12H16N3O3PS2/c1-3-17-19(20,18-4-2)21-9-15-12(16)10-7-5-6-8-11(10)13-14-15/h5-8H,3-4,9H2,1-2H3
37 atoms
S  1.294013 0.82039 1.276816
S  2.287034 1.541182 -1.916172
P  2.262095 0.241594 -0.503101
O  1.629188 -1.140044 -0.970704
O  3.665476 -0.222638 0.107903
O  -1.886531 0.717779 2.39557
N  -1.22961 1.006019 0.245963
N  -1.282589 0.742122 -1.072285
N  -2.185214 0.027553 -1.544923
C  -0.096333 1.804449 0.63856
C  -3.13471 -0.324739 0.660664
C  -2.06801 0.483558 1.21468
C  -3.148398 -0.521871 -0.72044
C  -4.119497 -0.901636 1.462325
C  -4.15185 -1.292447 -1.309895
C  1.492607 -2.294228 -0.104241
C  4.652456 0.745133 0.535132
C  -5.111604 -1.655768 0.872497
C  -5.127426 -1.849823 -0.512873
C  0.038244 -2.597191 0.142102
C  5.74492 0.877264 -0.493748
H  0.231616 2.390743 -0.217334
H  -0.37771 2.486759 1.436522
H  -4.107483 -0.751489 2.533171
H  -4.151078 -1.436537 -2.381865
H  1.983167 -3.11518 -0.625232
H  2.020333 -2.142693 0.838733
H  4.181249 1.711411 0.730145
H  5.040949 0.372927 1.481743
H  -5.884111 -2.101852 1.483686
H  -5.911581 -2.444859 -0.960715
H  -0.517795 -2.701904 -0.789363
H  -0.036832 -3.541629 0.681764
H  -0.435453 -1.831478 0.754703
H  5.362501 1.273162 -1.433885
H  6.502661 1.566862 -0.120859
H  6.229751 -0.079614 -0.686457
elementType: S P O N C H
totalener: -1994.76342197 hartree
nucrepener: 2267.04347728 hartree
electener: -4261.80689924 hartree
oneelecener: -7251.19845432 hartree
twoeener: 2989.39155508 hartree
cpcmener: -0.03696832 hartree
kineticenergy: 1989.07752609 hartree
xcener: -136.740861924422 hartree
chargesum: 0.0000000
charge: -0.167227 -0.430051 0.636352 -0.342595 -0.355190 -0.500061 0.077340 -0.107537 -0.134807 -0.040902 0.025499 0.337593 0.050446 -0.136352 -0.178445 0.031457 0.044934 -0.124137 -0.100863 -0.228515 -0.238089 0.158346 0.161792 0.152183 0.146699 0.110443 0.095160 0.085262 0.113127 0.167819 0.166603 0.092701 0.106781 0.064911 0.073764 0.094794 0.090764
qa: -0.1672 -0.4301 0.6364 -0.3426 -0.3552 -0.5001 0.0773 -0.1075 -0.1348 -0.0409 0.0255 0.3376 0.0504 -0.1364 -0.1784 0.0315 0.0449 -0.1241 -0.1009 -0.2285 -0.2381 0.1583 0.1618 0.1522 0.1467 0.1104 0.0952 0.0853 0.1131 0.1678 0.1666 0.0927 0.1068 0.0649 0.0738 0.0948 0.0908
va: 2.2614 2.0333 5.4434 2.0960 2.0780 2.0161 3.2348 2.8344 2.9780 3.8674 3.4474 4.2006 4.0006 3.9419 4.0050 3.8749 3.8405 3.9287 3.9222 3.9143 3.9413 1.0322 1.0048 1.0162 1.0169 0.9968 0.9975 1.0093 0.9932 0.9882 0.9863 1.0034 1.0114 1.0057 1.0209 1.0076 1.0037
dispcorr: -0.020368048 hartree
energy: -1994.783790015217
dipole: 7.26888 -8.34586 -1.07698 -9.86348 8.30258 -1.56089 3.58106 -2.25503 1.32603
magnitude: 2.31401 au
magnitude: 5.88174 debye
