program: Orca
programVersion: 5.0.4
elementType: S S P O O O N N N C C C C C C C C C C C C H H H H H H H H H H H H H H H H
charge: 0
multiplicity: 1
keywords: wb97x-d3
keywords: def2-TZVPP
keywords: def2/J RIJCOSX
keywords: DEFGRID2
keywords: scfconv7
keywords: smallprint printgap noloewdin
keywords: NOSOSCF
formula: C12H16N3O3PS2
InChI: InChI=1/C12H16N3O3PS2/c1-3-17-19(20,18-4-2)21-9-15-12(16)10-7-5-6-8-11(10)13-14-15/h5-8H,3-4,9H2,1-2H3
37 atoms
S  1.53405 1.7369 -1.613742
S  3.832818 0.320567 0.267278
P  2.028686 0.137733 -0.3705
O  1.673687 -1.126361 -1.267278
O  0.880985 0.074014 0.746177
O  -1.288057 -1.195265 -1.764324
N  -1.111901 1.032468 -1.317536
N  -1.446578 2.147396 -0.640213
N  -2.237032 2.103412 0.319208
C  -0.092838 1.260452 -2.31168
C  -2.468345 -0.299209 0.083457
C  -1.588706 -0.244249 -1.066541
C  -2.760076 0.894645 0.741601
C  -2.99703 -1.504423 0.543275
C  -3.588367 0.892656 1.864599
C  2.081602 -2.472189 -0.923969
C  0.911652 0.940354 1.902366
C  -3.810481 -1.500748 1.657162
C  -4.104714 -0.303078 2.316727
C  1.35131 -3.029323 0.272989
C  1.349474 0.172655 3.122877
H  0.008637 0.383407 -2.940536
H  -0.374523 2.102208 -2.942806
H  -2.768116 -2.430431 0.033583
H  -3.807749 1.825421 2.367008
H  1.862187 -3.05276 -1.817159
H  3.162303 -2.485289 -0.770098
H  1.563966 1.797815 1.72291
H  -0.101854 1.318491 2.023796
H  -4.222807 -2.430617 2.024355
H  -4.743378 -0.316045 3.189443
H  1.647239 -2.546365 1.203871
H  0.269842 -2.945936 0.159524
H  1.597378 -4.088112 0.362497
H  2.372281 -0.190391 3.02161
H  1.309833 0.832231 3.990825
H  0.690542 -0.674256 3.316225
elementType: S P O N C H
totalener: -1994.76053378 hartree
nucrepener: 2352.83384714 hartree
electener: -4347.59438092 hartree
oneelecener: -7422.58408465 hartree
twoeener: 3074.98970374 hartree
cpcmener: -0.03405467 hartree
kineticenergy: 1989.07007857 hartree
xcener: -136.740961472646 hartree
chargesum: 0.0000000
charge: -0.144362 -0.438366 0.609604 -0.335138 -0.322839 -0.496527 0.076676 -0.105488 -0.149081 -0.040255 0.068603 0.301563 0.027954 -0.141929 -0.173838 0.011095 0.045050 -0.120289 -0.098981 -0.228541 -0.250358 0.147789 0.167880 0.153830 0.146740 0.113225 0.101463 0.093595 0.105949 0.167020 0.165903 0.078797 0.081670 0.106156 0.079352 0.104243 0.091833
qa: -0.1444 -0.4384 0.6096 -0.3351 -0.3228 -0.4965 0.0767 -0.1055 -0.1491 -0.0403 0.0686 0.3016 0.0280 -0.1419 -0.1738 0.0111 0.0451 -0.1203 -0.0990 -0.2285 -0.2504 0.1478 0.1679 0.1538 0.1467 0.1132 0.1015 0.0936 0.1059 0.1670 0.1659 0.0788 0.0817 0.1062 0.0794 0.1042 0.0918
va: 2.2841 2.0309 5.4409 2.0971 2.0402 2.0101 3.2378 2.8330 2.9678 3.9015 3.4281 4.2440 3.9906 3.9364 4.0016 3.8631 3.8285 3.9288 3.9200 3.9028 3.9411 1.0273 0.9992 1.0147 1.0160 0.9906 1.0090 1.0136 0.9905 0.9879 0.9864 1.0089 1.0082 1.0111 1.0185 1.0094 1.0014
dispcorr: -0.023162781 hartree
energy: -1994.783696559924
dipole: -3.31995 0.80876 -2.51120 -13.63499 12.50236 -1.13263 14.37159 -12.89458 1.47700
magnitude: 3.12578 au
magnitude: 7.94510 debye
