program: Orca
programVersion: 5.0.4
elementType: S S P O O O N N N C C C C C C C C C C C C H H H H H H H H H H H H H H H H
charge: 0
multiplicity: 1
keywords: wb97x-d3
keywords: def2-TZVPP
keywords: def2/J RIJCOSX
keywords: DEFGRID2
keywords: scfconv7
keywords: smallprint printgap noloewdin
keywords: NOSOSCF
formula: C12H16N3O3PS2
InChI: InChI=1/C12H16N3O3PS2/c1-3-17-19(20,18-4-2)21-9-15-12(16)10-7-5-6-8-11(10)13-14-15/h5-8H,3-4,9H2,1-2H3
37 atoms
S  1.589865 1.579251 -1.756877
S  3.69663 0.538771 0.564309
P  1.88652 0.396275 -0.066656
O  1.355223 -1.061026 -0.455038
O  0.73207 0.903272 0.906755
O  -1.285151 -1.448552 -1.866008
N  -1.033259 0.788279 -1.500737
N  -1.374927 1.946893 -0.903623
N  -2.162838 1.963591 0.057563
C  0.026115 0.936717 -2.467873
C  -2.42667 -0.44398 -0.049695
C  -1.552361 -0.462274 -1.204571
C  -2.682895 0.784167 0.557253
C  -2.969521 -1.615918 0.475358
C  -3.48253 0.848552 1.698952
C  2.155664 -1.953208 -1.262361
C  0.721913 0.645499 2.328633
C  -3.753806 -1.546405 1.607351
C  -4.007169 -0.314822 2.219397
C  2.748838 -3.039213 -0.402797
C  0.276102 -0.75534 2.66227
H  0.20188 -0.014722 -2.956891
H  -0.251051 1.666583 -3.227391
H  -2.766889 -2.567983 0.004225
H  -3.675979 1.807886 2.159621
H  1.481236 -2.362896 -2.012521
H  2.936544 -1.398887 -1.787899
H  1.711829 0.856389 2.73784
H  0.027352 1.379432 2.733266
H  -4.174809 -2.449989 2.02637
H  -4.623553 -0.275744 3.107125
H  3.310422 -3.728733 -1.033137
H  3.4323 -2.628851 0.339862
H  1.973737 -3.608951 0.109314
H  0.203399 -0.846277 3.746311
H  -0.706322 -0.974728 2.243499
H  0.982861 -1.50918 2.315672
elementType: S P O N C H
totalener: -1994.75928430 hartree
nucrepener: 2370.46220297 hartree
electener: -4365.22148727 hartree
oneelecener: -7457.77860623 hartree
twoeener: 3092.55711896 hartree
cpcmener: -0.03386123 hartree
kineticenergy: 1989.09304455 hartree
xcener: -136.745840538144 hartree
chargesum: 0.0000000
charge: -0.146837 -0.437387 0.603764 -0.323845 -0.336239 -0.500633 0.065662 -0.100917 -0.140780 -0.031398 0.025652 0.313843 0.050726 -0.127568 -0.177921 0.049884 0.024869 -0.112227 -0.103189 -0.241684 -0.230021 0.145851 0.167545 0.148209 0.146698 0.096893 0.092187 0.107383 0.108422 0.166557 0.165441 0.100977 0.076516 0.092111 0.108208 0.068479 0.084767
qa: -0.1468 -0.4374 0.6038 -0.3238 -0.3362 -0.5006 0.0657 -0.1009 -0.1408 -0.0314 0.0257 0.3138 0.0507 -0.1276 -0.1779 0.0499 0.0249 -0.1122 -0.1032 -0.2417 -0.2300 0.1459 0.1675 0.1482 0.1467 0.0969 0.0922 0.1074 0.1084 0.1666 0.1654 0.1010 0.0765 0.0921 0.1082 0.0685 0.0848
va: 2.2770 2.0355 5.4587 2.0603 2.0907 2.0110 3.2357 2.8332 2.9853 3.9117 3.4318 4.2229 3.9702 3.9105 3.9936 3.8285 3.8354 3.9165 3.9177 3.9380 3.9102 1.0204 0.9990 1.0187 1.0159 1.0028 1.0103 1.0127 0.9925 0.9882 0.9866 1.0089 1.0190 1.0029 1.0106 1.0063 1.0151
dispcorr: -0.024017763 hartree
energy: -1994.783302058109
dipole: -1.68120 -0.48128 -2.16248 -16.87556 15.31966 -1.55590 10.37382 -9.42466 0.94916
magnitude: 2.82808 au
magnitude: 7.18841 debye
