program: Orca
programVersion: 5.0.4
elementType: S S P O O O N N N C C C C C C C C C C C C H H H H H H H H H H H H H H H H
charge: 0
multiplicity: 1
keywords: wb97x-d3
keywords: def2-TZVPP
keywords: def2/J RIJCOSX
keywords: DEFGRID2
keywords: scfconv7
keywords: smallprint printgap noloewdin
keywords: NOSOSCF
formula: C12H16N3O3PS2
InChI: InChI=1/C12H16N3O3PS2/c1-3-17-19(20,18-4-2)21-9-15-12(16)10-7-5-6-8-11(10)13-14-15/h5-8H,3-4,9H2,1-2H3
37 atoms
S  1.404162 0.717321 -2.140718
S  3.756129 -0.802675 -0.440148
P  2.088041 0.137924 -0.26426
O  0.890057 -0.66883 0.436131
O  2.073713 1.500125 0.561305
O  -1.690379 -0.194275 -2.545014
N  -1.015851 1.244675 -0.931089
N  -1.041313 1.756338 0.314502
N  -1.788044 1.276356 1.186062
C  -0.008774 1.828309 -1.777343
C  -2.613577 -0.397454 -0.363916
C  -1.771082 0.180023 -1.389853
C  -2.581347 0.181056 0.90466
C  -3.404307 -1.520652 -0.605299
C  -3.351744 -0.352915 1.939196
C  0.610059 -2.043824 0.097458
C  2.763462 1.643014 1.827105
C  -4.154857 -2.049036 0.423417
C  -4.129215 -1.463619 1.69389
C  -0.148746 -2.676321 1.233727
C  2.044843 0.967175 2.968832
H  -0.419691 2.0808 -2.753358
H  0.343775 2.739644 -1.304098
H  -3.42215 -1.972957 -1.587254
H  -3.318933 0.105971 2.91827
H  0.03204 -2.067479 -0.82874
H  1.547741 -2.574174 -0.078235
H  3.782632 1.265682 1.722389
H  2.818844 2.718138 1.983958
H  -4.768724 -2.922187 0.24896
H  -4.724407 -1.888543 2.490611
H  -1.096148 -2.172939 1.426627
H  -0.369326 -3.711934 0.975022
H  0.438819 -2.677454 2.151823
H  2.072003 -0.11933 2.893464
H  2.541598 1.242041 3.899663
H  1.006089 1.289668 3.037517
elementType: S P O N C H
totalener: -1994.76298355 hartree
nucrepener: 2355.10308453 hartree
electener: -4349.86606808 hartree
oneelecener: -7426.94772709 hartree
twoeener: 3077.08165901 hartree
cpcmener: -0.03455534 hartree
kineticenergy: 1989.07701067 hartree
xcener: -136.741965368800 hartree
chargesum: -0.0000000
charge: -0.146510 -0.441594 0.612432 -0.321475 -0.333958 -0.490747 0.071279 -0.121231 -0.139314 -0.040778 0.033068 0.316704 0.063912 -0.145241 -0.177246 0.015510 0.021517 -0.116658 -0.095405 -0.242916 -0.233005 0.166335 0.151312 0.149518 0.146746 0.107736 0.119815 0.093790 0.110570 0.166929 0.166247 0.065145 0.103387 0.097947 0.077680 0.103800 0.084701
qa: -0.1465 -0.4416 0.6124 -0.3215 -0.3340 -0.4907 0.0713 -0.1212 -0.1393 -0.0408 0.0331 0.3167 0.0639 -0.1452 -0.1772 0.0155 0.0215 -0.1167 -0.0954 -0.2429 -0.2330 0.1663 0.1513 0.1495 0.1467 0.1077 0.1198 0.0938 0.1106 0.1669 0.1662 0.0651 0.1034 0.0979 0.0777 0.1038 0.0847
va: 2.2799 2.0383 5.4382 2.0524 2.0975 2.0256 3.2375 2.8380 2.9701 3.9038 3.4238 4.2121 3.9521 3.9336 3.9864 3.8119 3.8677 3.9173 3.9105 3.9456 3.9016 0.9955 1.0197 1.0179 1.0157 0.9941 1.0145 1.0101 0.9902 0.9883 0.9865 1.0092 1.0073 1.0082 1.0147 1.0103 1.0097
dispcorr: -0.023626270 hartree
energy: -1994.786609819844
dipole: -5.00490 2.57386 -2.43104 -7.98787 7.56176 -0.42610 16.70573 -14.78808 1.91765
magnitude: 3.12553 au
magnitude: 7.94445 debye
