program: Orca
programVersion: 5.0.4
elementType: S S P O O O N N N C C C C C C C C C C C C H H H H H H H H H H H H H H H H
charge: 0
multiplicity: 1
keywords: wb97x-d3
keywords: def2-TZVPP
keywords: def2/J RIJCOSX
keywords: DEFGRID2
keywords: scfconv7
keywords: smallprint printgap noloewdin
keywords: NOSOSCF
formula: C12H16N3O3PS2
InChI: InChI=1/C12H16N3O3PS2/c1-3-17-19(20,18-4-2)21-9-15-12(16)10-7-5-6-8-11(10)13-14-15/h5-8H,3-4,9H2,1-2H3
37 atoms
S  1.576897 1.549116 -1.603653
S  3.639285 0.791474 0.834413
P  2.000178 0.265365 -0.02275
O  1.907687 -1.238433 -0.551575
O  0.660627 0.354679 0.843511
O  -1.012671 -1.565306 -1.516242
N  -1.035407 0.711135 -1.508507
N  -1.502311 1.901965 -1.091719
N  -2.389697 1.975834 -0.223398
C  0.091421 0.826365 -2.398144
C  -2.473141 -0.439197 -0.0289
C  -1.460491 -0.531844 -1.062965
C  -2.899382 0.829644 0.358197
C  -2.986669 -1.575267 0.594379
C  -3.853788 0.971508 1.367218
C  3.013331 -1.971567 -1.10935
C  0.533732 -0.427164 2.055325
C  -3.921636 -1.428528 1.597525
C  -4.355228 -0.155701 1.981752
C  2.881587 -3.413949 -0.693812
C  -0.179568 0.400233 3.090686
H  0.318521 -0.141974 -2.830865
H  -0.144001 1.519281 -3.205028
H  -2.649001 -2.558297 0.294813
H  -4.176913 1.962679 1.657189
H  2.978947 -1.8634 -2.194834
H  3.956661 -1.550206 -0.755897
H  -0.021723 -1.334138 1.813184
H  1.520493 -0.723351 2.420283
H  -4.322547 -2.303653 2.091104
H  -5.089171 -0.056591 2.770409
H  3.701967 -3.988403 -1.124984
H  2.931893 -3.519999 0.390305
H  1.946733 -3.851922 -1.044518
H  -1.170334 0.705756 2.752888
H  -0.305509 -0.193025 3.99688
H  0.392587 1.291364 3.350124
elementType: S P O N C H
totalener: -1994.76772085 hartree
nucrepener: 2335.49509500 hartree
electener: -4330.26281585 hartree
oneelecener: -7387.81885543 hartree
twoeener: 3057.55603958 hartree
cpcmener: -0.03032386 hartree
kineticenergy: 1989.07868945 hartree
xcener: -136.739338986739 hartree
chargesum: 0.0000000
charge: -0.138057 -0.435022 0.593468 -0.308094 -0.328999 -0.464311 0.069417 -0.105438 -0.135070 -0.039629 0.034189 0.298349 0.038399 -0.157031 -0.169817 0.042642 0.016305 -0.108762 -0.102829 -0.238934 -0.241568 0.149096 0.162315 0.151454 0.143244 0.100678 0.091314 0.108019 0.111284 0.163385 0.162451 0.090347 0.084529 0.090149 0.085594 0.094935 0.091998
qa: -0.1381 -0.4350 0.5935 -0.3081 -0.3290 -0.4643 0.0694 -0.1054 -0.1351 -0.0396 0.0342 0.2983 0.0384 -0.1570 -0.1698 0.0426 0.0163 -0.1088 -0.1028 -0.2389 -0.2416 0.1491 0.1623 0.1515 0.1432 0.1007 0.0913 0.1080 0.1113 0.1634 0.1625 0.0903 0.0845 0.0901 0.0856 0.0949 0.0920
va: 2.2933 2.0369 5.4593 2.0920 2.0729 2.0530 3.2286 2.8254 2.9932 3.9111 3.3776 4.2687 3.9925 3.9297 3.9791 3.8354 3.8313 3.9164 3.9264 3.9455 3.9532 1.0211 1.0012 1.0177 1.0182 0.9919 1.0147 0.9950 1.0110 0.9890 0.9878 1.0084 1.0067 1.0047 0.9995 1.0077 1.0106
dispcorr: -0.022543627 hartree
energy: -1994.790264475836
dipole: -1.96058 -0.02514 -1.98572 -16.24474 14.31406 -1.93068 9.95076 -9.43237 0.51839
magnitude: 2.81768 au
magnitude: 7.16198 debye
