program: Orca
programVersion: 5.0.4
elementType: S S P O O O N N N C C C C C C C C C C C C H H H H H H H H H H H H H H H H
charge: 0
multiplicity: 1
keywords: wb97x-d3
keywords: def2-TZVPP
keywords: def2/J RIJCOSX
keywords: DEFGRID2
keywords: scfconv7
keywords: smallprint printgap noloewdin
keywords: NOSOSCF
formula: C12H16N3O3PS2
InChI: InChI=1/C12H16N3O3PS2/c1-3-17-19(20,18-4-2)21-9-15-12(16)10-7-5-6-8-11(10)13-14-15/h5-8H,3-4,9H2,1-2H3
37 atoms
S  1.066768 0.727702 -1.092958
S  3.852208 -0.877566 -1.598475
P  2.676035 -0.26705 -0.206511
O  2.071963 -1.3484 0.797065
O  3.259688 0.712027 0.907918
O  -2.213025 2.466836 -0.669876
N  -1.206139 0.722725 0.385511
N  -1.192702 -0.518657 0.899972
N  -2.232092 -1.198628 0.965028
C  0.099286 1.334042 0.340024
C  -3.52421 0.586352 -0.050751
C  -2.305547 1.367188 -0.163086
C  -3.432262 -0.689171 0.507044
C  -4.753509 1.068912 -0.498873
C  -4.567936 -1.494168 0.612863
C  1.44458 -2.543035 0.294303
C  4.347707 1.621931 0.653148
C  -5.873173 0.271773 -0.383526
C  -5.778818 -1.01021 0.167883
C  0.885111 -3.310034 1.463153
C  3.966856 2.770143 -0.248957
H  -0.009915 2.409125 0.237892
H  0.620838 1.133827 1.272234
H  -4.82535 2.058806 -0.929097
H  -4.477791 -2.483938 1.040839
H  0.654596 -2.278378 -0.412859
H  2.189968 -3.136547 -0.2395
H  4.633511 1.983461 1.639573
H  5.192174 1.06463 0.24314
H  -6.832162 0.638959 -0.723659
H  -6.66496 -1.625924 0.245734
H  0.40265 -4.215507 1.094338
H  1.670547 -3.61005 2.157615
H  0.140224 -2.730312 2.007448
H  3.780362 2.446724 -1.272908
H  3.085082 3.296682 0.117572
H  4.79386 3.480895 -0.274747
elementType: S P O N C H
totalener: -1994.76979288 hartree
nucrepener: 2213.96297472 hartree
electener: -4208.73276760 hartree
oneelecener: -7144.48968728 hartree
twoeener: 2935.75691968 hartree
cpcmener: -0.02735574 hartree
kineticenergy: 1989.07689812 hartree
xcener: -136.739914746418 hartree
chargesum: -0.0000000
charge: -0.153743 -0.434026 0.619415 -0.329296 -0.337627 -0.471921 0.064242 -0.108776 -0.144409 -0.035934 -0.019747 0.362660 0.085299 -0.139716 -0.181139 0.010677 0.038152 -0.119055 -0.101316 -0.252839 -0.253920 0.150300 0.145749 0.152091 0.147449 0.104239 0.119771 0.110122 0.096880 0.163767 0.163281 0.090146 0.094027 0.085108 0.081906 0.093003 0.105180
qa: -0.1537 -0.4340 0.6194 -0.3293 -0.3376 -0.4719 0.0642 -0.1088 -0.1444 -0.0359 -0.0197 0.3627 0.0853 -0.1397 -0.1811 0.0107 0.0382 -0.1191 -0.1013 -0.2528 -0.2539 0.1503 0.1457 0.1521 0.1474 0.1042 0.1198 0.1101 0.0969 0.1638 0.1633 0.0901 0.0940 0.0851 0.0819 0.0930 0.1052
va: 2.2665 2.0286 5.4623 2.1057 2.1055 2.0557 3.2733 2.8245 2.9656 3.8926 3.5191 4.2211 4.0197 3.9504 3.9871 3.8057 3.8378 3.9278 3.9243 3.9562 3.8977 1.0183 1.0265 1.0160 1.0157 1.0011 1.0084 0.9922 1.0117 0.9895 0.9877 1.0049 1.0051 1.0110 1.0152 1.0034 1.0112
dispcorr: -0.018736379 hartree
energy: -1994.788529255814
dipole: 1.73970 -3.87824 -2.13854 -1.22174 1.31799 0.09624 6.35547 -5.10252 1.25294
magnitude: 2.48042 au
magnitude: 6.30473 debye
