program: Orca
programVersion: 5.0.4
elementType: S S P O O O N N N C C C C C C C C C C C C H H H H H H H H H H H H H H H H
charge: 0
multiplicity: 1
keywords: wb97x-d3
keywords: def2-TZVPP
keywords: def2/J RIJCOSX
keywords: DEFGRID2
keywords: scfconv7
keywords: smallprint printgap noloewdin
keywords: NOSOSCF
formula: C12H16N3O3PS2
InChI: InChI=1/C12H16N3O3PS2/c1-3-17-19(20,18-4-2)21-9-15-12(16)10-7-5-6-8-11(10)13-14-15/h5-8H,3-4,9H2,1-2H3
37 atoms
S  1.185475 1.032416 -1.604747
S  3.547293 -1.211841 -1.129104
P  2.169157 -0.200434 -0.247875
O  0.95251 -1.009183 0.398702
O  2.627423 0.709767 0.987829
O  -1.963107 1.279737 -2.1550
N  -1.06897 1.290487 -0.077176
N  -1.048622 0.969903 1.227196
N  -1.953949 0.277041 1.726283
C  0.086605 2.020299 -0.528305
C  -3.075968 0.095439 -0.419082
C  -2.036533 0.922741 -0.996729
C  -2.98569 -0.201565 0.940937
C  -4.125445 -0.414365 -1.183159
C  -3.947694 -1.013465 1.545958
C  1.203031 -1.985447 1.436591
C  3.94283 1.287772 1.094012
C  -5.069632 -1.217063 -0.579842
C  -4.979432 -1.516074 0.784108
C  0.003162 -2.888247 1.547372
C  4.180708 2.403451 0.106481
H  -0.211746 2.876928 -1.130345
H  0.624142 2.383486 0.343172
H  -4.191591 -0.183059 -2.237829
H  -3.864685 -1.238513 2.601116
H  2.095797 -2.564057 1.186319
H  1.388119 -1.462757 2.376586
H  3.996911 1.657334 2.117012
H  4.690914 0.500451 0.98216
H  -5.8855 -1.621115 -1.163995
H  -5.726152 -2.150526 1.242772
H  0.199282 -3.642319 2.310401
H  -0.890852 -2.34029 1.845454
H  -0.198017 -3.406612 0.609486
H  4.219519 2.042758 -0.921452
H  3.416261 3.177589 0.177694
H  5.143566 2.866142 0.327019
elementType: S P O N C H
totalener: -1994.76998279 hartree
nucrepener: 2282.79012645 hartree
electener: -4277.56010924 hartree
oneelecener: -7282.55097742 hartree
twoeener: 3004.99086818 hartree
cpcmener: -0.02936020 hartree
kineticenergy: 1989.08052950 hartree
xcener: -136.739458379009 hartree
chargesum: 0.0000000
charge: -0.131492 -0.436912 0.616815 -0.330775 -0.341981 -0.466945 0.071376 -0.108198 -0.154046 -0.057424 0.019107 0.334729 0.053143 -0.138750 -0.177887 0.016571 0.040712 -0.123490 -0.092370 -0.242240 -0.250158 0.167820 0.150410 0.151322 0.144557 0.100351 0.111224 0.109469 0.095458 0.164392 0.163301 0.095323 0.082242 0.089125 0.078284 0.093075 0.103861
qa: -0.1315 -0.4369 0.6168 -0.3308 -0.3420 -0.4669 0.0714 -0.1082 -0.1540 -0.0574 0.0191 0.3347 0.0531 -0.1388 -0.1779 0.0166 0.0407 -0.1235 -0.0924 -0.2422 -0.2502 0.1678 0.1504 0.1513 0.1446 0.1004 0.1112 0.1095 0.0955 0.1644 0.1633 0.0953 0.0822 0.0891 0.0783 0.0931 0.1039
va: 2.2771 2.0299 5.4297 2.1044 2.0656 2.0596 3.2425 2.8436 2.9667 3.9065 3.5032 4.2375 4.0063 3.9493 3.9834 3.8425 3.8386 3.9272 3.9154 3.9577 3.9097 0.9986 1.0236 1.0154 1.0179 1.0078 0.9965 0.9918 1.0135 0.9893 0.9874 1.0082 1.0042 1.0062 1.0161 1.0020 1.0126
dispcorr: -0.020410130 hartree
energy: -1994.790392921495
dipole: 2.81262 -4.25796 -1.44533 -2.94641 3.11985 0.17344 10.78386 -8.72724 2.05662
magnitude: 2.51967 au
magnitude: 6.40450 debye
