program: Orca
programVersion: 5.0.4
elementType: S S P O O O N N N C C C C C C C C C C C C H H H H H H H H H H H H H H H H
charge: 0
multiplicity: 1
keywords: wb97x-d3
keywords: def2-TZVPP
keywords: def2/J RIJCOSX
keywords: DEFGRID2
keywords: scfconv7
keywords: smallprint printgap noloewdin
keywords: NOSOSCF
formula: C12H16N3O3PS2
InChI: InChI=1/C12H16N3O3PS2/c1-3-17-19(20,18-4-2)21-9-15-12(16)10-7-5-6-8-11(10)13-14-15/h5-8H,3-4,9H2,1-2H3
37 atoms
S  1.456269 0.57251 -1.584356
S  2.549323 1.883874 1.395204
P  2.283416 0.308006 0.330068
O  3.589261 -0.467743 -0.171586
O  1.371199 -0.757513 1.09482
O  -1.736922 0.444542 -2.690189
N  -1.055582 1.171153 -0.655556
N  -1.150053 1.262352 0.682754
N  -2.114869 0.764119 1.289907
C  0.13593 1.768408 -1.20107
C  -3.077317 -0.043562 -0.786926
C  -1.940996 0.514808 -1.494782
C  -3.113642 0.104037 0.599922
C  -4.101269 -0.721574 -1.447874
C  -4.174417 -0.428901 1.335325
C  4.800767 -0.528276 0.610838
C  1.167341 -2.111524 0.628427
C  -5.148625 -1.23995 -0.716106
C  -5.183593 -1.094237 0.674862
C  4.670048 -1.412966 1.825236
C  -0.261407 -2.330558 0.202106
H  -0.092091 2.27026 -2.139052
H  0.506094 2.509663 -0.494941
H  -4.071499 -0.836756 -2.522998
H  -4.187154 -0.30958 2.41071
H  5.550396 -0.918142 -0.075879
H  5.095985 0.48478 0.890905
H  1.851809 -2.354737 -0.186029
H  1.423444 -2.754302 1.470532
H  -5.949168 -1.765184 -1.2194
H  -6.010538 -1.509203 1.235697
H  3.976458 -1.00569 2.561728
H  4.348219 -2.419679 1.557458
H  5.645665 -1.494281 2.306404
H  -0.403399 -3.391787 -0.007606
H  -0.966705 -2.051349 0.984701
H  -0.501144 -1.785982 -0.710165
elementType: S P O N C H
totalener: -1994.76832934 hartree
nucrepener: 2282.01918416 hartree
electener: -4276.78751351 hartree
oneelecener: -7281.04576716 hartree
twoeener: 3004.25825365 hartree
cpcmener: -0.03141096 hartree
kineticenergy: 1989.07189653 hartree
xcener: -136.738911880964 hartree
chargesum: 0.0000000
charge: -0.143230 -0.424735 0.613342 -0.349738 -0.323670 -0.467037 0.085542 -0.105127 -0.131626 -0.067527 0.037845 0.301134 0.025078 -0.139520 -0.166978 0.024871 0.033139 -0.119355 -0.103650 -0.247928 -0.252669 0.161379 0.158702 0.151392 0.145622 0.108194 0.098210 0.100271 0.107020 0.163883 0.163275 0.087558 0.089648 0.105870 0.108087 0.095487 0.077241
qa: -0.1432 -0.4247 0.6133 -0.3497 -0.3237 -0.4670 0.0855 -0.1051 -0.1316 -0.0675 0.0378 0.3011 0.0251 -0.1395 -0.1670 0.0249 0.0331 -0.1194 -0.1036 -0.2479 -0.2527 0.1614 0.1587 0.1514 0.1456 0.1082 0.0982 0.1003 0.1070 0.1639 0.1633 0.0876 0.0896 0.1059 0.1081 0.0955 0.0772
va: 2.2718 2.0449 5.4297 2.0864 2.0623 2.0545 3.2086 2.8344 2.9846 3.8906 3.4203 4.2365 4.0050 3.9514 3.9978 3.8634 3.8591 3.9257 3.9259 3.8873 3.9492 1.0038 1.0293 1.0165 1.0172 0.9914 1.0109 0.9996 0.9915 0.9895 0.9875 1.0168 1.0039 1.0093 1.0103 0.9980 1.0055
dispcorr: -0.021471779 hartree
energy: -1994.789801124110
dipole: 3.63584 -4.77110 -1.13525 -17.12178 14.79175 -2.33003 5.24769 -5.20739 0.04030
magnitude: 2.59219 au
magnitude: 6.58883 debye
