program: Orca
programVersion: 5.0.4
elementType: S S P O O O N N N C C C C C C C C C C C C H H H H H H H H H H H H H H H H
charge: 0
multiplicity: 1
keywords: wb97x-d3
keywords: def2-TZVPP
keywords: def2/J RIJCOSX
keywords: DEFGRID2
keywords: scfconv7
keywords: smallprint printgap noloewdin
keywords: NOSOSCF
formula: C12H16N3O3PS2
InChI: InChI=1/C12H16N3O3PS2/c1-3-17-19(20,18-4-2)21-9-15-12(16)10-7-5-6-8-11(10)13-14-15/h5-8H,3-4,9H2,1-2H3
37 atoms
S  1.599521 1.56412 -1.539609
S  3.916916 0.576847 0.556913
P  2.196377 0.121023 -0.166317
O  2.057871 -1.227998 -1.000175
O  1.006209 -0.046159 0.894888
O  -1.071007 -1.516069 -1.401152
N  -1.013029 0.757569 -1.274822
N  -1.425051 1.940021 -0.783583
N  -2.297612 2.000546 0.101021
C  0.051049 0.889911 -2.239698
C  -2.48643 -0.416364 0.148855
C  -1.478098 -0.491375 -0.891666
C  -2.858189 0.84529 0.611928
C  -3.060925 -1.562606 0.696094
C  -3.808488 0.969502 1.62704
C  2.139833 -2.519707 -0.354751
C  0.831869 0.863085 1.998325
C  -3.998647 -1.433396 1.699173
C  -4.371168 -0.167895 2.163914
C  2.200247 -3.574124 -1.42753
C  -0.038782 0.200417 3.035755
H  0.230758 -0.066406 -2.718772
H  -0.238113 1.60822 -3.005955
H  -2.769905 -2.540487 0.336559
H  -4.084481 1.95556 1.977181
H  3.030327 -2.553968 0.277957
H  1.263891 -2.661457 0.279878
H  1.807231 1.114468 2.421328
H  0.377252 1.785055 1.628973
H  -4.449895 -2.317171 2.129822
H  -5.107307 -0.082566 2.95225
H  1.315612 -3.545869 -2.064137
H  3.086862 -3.463515 -2.052242
H  2.242278 -4.556486 -0.956886
H  -0.185304 0.890651 3.866837
H  -1.021323 -0.0591 2.64191
H  0.429898 -0.701488 3.429675
elementType: S P O N C H
totalener: -1994.77026736 hartree
nucrepener: 2330.50994310 hartree
electener: -4325.28021046 hartree
oneelecener: -7377.50080225 hartree
twoeener: 3052.22059179 hartree
cpcmener: -0.02862715 hartree
kineticenergy: 1989.06675131 hartree
xcener: -136.737742425753 hartree
chargesum: 0.0000000
charge: -0.136537 -0.432830 0.599207 -0.330816 -0.316747 -0.472638 0.081755 -0.106306 -0.141368 -0.048086 0.022638 0.293283 0.052645 -0.126469 -0.178917 0.022162 0.004929 -0.116979 -0.094647 -0.238058 -0.225107 0.149059 0.166060 0.150183 0.144812 0.105759 0.106793 0.116447 0.107607 0.163217 0.162803 0.086857 0.088657 0.087899 0.096267 0.062214 0.094254
qa: -0.1365 -0.4328 0.5992 -0.3308 -0.3167 -0.4726 0.0818 -0.1063 -0.1414 -0.0481 0.0226 0.2933 0.0526 -0.1265 -0.1789 0.0222 0.0049 -0.1170 -0.0946 -0.2381 -0.2251 0.1491 0.1661 0.1502 0.1448 0.1058 0.1068 0.1164 0.1076 0.1632 0.1628 0.0869 0.0887 0.0879 0.0963 0.0622 0.0943
va: 2.2913 2.0481 5.4610 2.1000 2.0613 2.0438 3.2297 2.8184 2.9800 3.9039 3.4282 4.2421 3.9630 3.9302 4.0059 3.8406 3.8273 3.9295 3.9167 3.9547 3.9418 1.0270 1.0006 1.0168 1.0173 1.0054 0.9967 1.0152 0.9932 0.9896 0.9877 1.0077 1.0048 1.0070 1.0087 1.0100 1.0079
dispcorr: -0.022698336 hartree
energy: -1994.792965694863
dipole: -6.08715 3.21822 -2.86894 -14.49793 13.28227 -1.21566 10.27455 -9.04708 1.22748
magnitude: 3.34893 au
magnitude: 8.51230 debye
