program: Orca
programVersion: 5.0.4
elementType: S S P O O O N N N C C C C C C C C C C C C H H H H H H H H H H H H H H H H
charge: 0
multiplicity: 1
keywords: wb97x-d3
keywords: def2-TZVPP
keywords: def2/J RIJCOSX
keywords: DEFGRID2
keywords: scfconv7
keywords: smallprint printgap noloewdin
keywords: NOSOSCF
formula: C12H16N3O3PS2
InChI: InChI=1/C12H16N3O3PS2/c1-3-17-19(20,18-4-2)21-9-15-12(16)10-7-5-6-8-11(10)13-14-15/h5-8H,3-4,9H2,1-2H3
37 atoms
S  1.184579 -0.954977 -1.736752
S  2.801165 1.986724 -0.997786
P  2.23802 0.254107 -0.387465
O  3.480835 -0.68138 -0.02438
O  1.245613 0.240367 0.869821
O  -2.06051 -1.62967 -1.797235
N  -1.155979 0.384985 -1.291951
N  -1.05988 1.512539 -0.566922
N  -1.883285 1.765821 0.33114
C  -0.104361 0.21921 -2.261943
C  -3.077274 -0.30397 -0.104288
C  -2.097128 -0.617601 -1.126424
C  -2.920355 0.891401 0.598495
C  -4.145838 -1.154098 0.183004
C  -3.828633 1.239985 1.600152
C  3.357012 -2.010664 0.53308
C  1.32704 1.230601 1.917517
C  -5.044614 -0.79818 1.166024
C  -4.883002 0.39658 1.87604
C  4.611295 -2.317106 1.309164
C  2.554598 1.066462 2.780954
H  -0.507056 -0.17656 -3.19185
H  0.338149 1.193222 -2.461215
H  -4.266061 -2.078997 -0.36536
H  -3.69266 2.167574 2.140857
H  2.479535 -2.074637 1.178722
H  3.22914 -2.719968 -0.287292
H  1.289339 2.227325 1.473815
H  0.419339 1.087511 2.501914
H  -5.880351 -1.447456 1.392107
H  -5.594081 0.660377 2.64751
H  4.541123 -3.327541 1.713284
H  5.497502 -2.272551 0.67559
H  4.7442 -1.630756 2.14576
H  2.610953 0.069299 3.218975
H  3.47622 1.264281 2.232072
H  2.506469 1.785142 3.600538
elementType: S P O N C H
totalener: -1994.76917067 hartree
nucrepener: 2266.96736146 hartree
electener: -4261.73653212 hartree
oneelecener: -7250.87450999 hartree
twoeener: 2989.13797787 hartree
cpcmener: -0.03006782 hartree
kineticenergy: 1989.05868881 hartree
xcener: -136.734338910640 hartree
chargesum: 0.0000000
charge: -0.153840 -0.431035 0.624001 -0.346801 -0.340447 -0.468138 0.069545 -0.110881 -0.154525 -0.046960 -0.001821 0.343681 0.090625 -0.138566 -0.187883 -0.000911 0.036059 -0.123093 -0.098406 -0.243716 -0.248039 0.161808 0.154095 0.151456 0.146868 0.118694 0.116605 0.099448 0.107274 0.164057 0.162768 0.090504 0.091246 0.087286 0.089918 0.083672 0.105451
qa: -0.1538 -0.4310 0.6240 -0.3468 -0.3404 -0.4681 0.0695 -0.1109 -0.1545 -0.0470 -0.0018 0.3437 0.0906 -0.1386 -0.1879 -0.0009 0.0361 -0.1231 -0.0984 -0.2437 -0.2480 0.1618 0.1541 0.1515 0.1469 0.1187 0.1166 0.0994 0.1073 0.1641 0.1628 0.0905 0.0912 0.0873 0.0899 0.0837 0.1055
va: 2.2726 2.0248 5.4479 2.1046 2.0488 2.0587 3.2340 2.8396 2.9750 3.9032 3.5157 4.2350 3.9915 3.9435 4.0107 3.8488 3.8123 3.9281 3.9202 3.9643 3.9345 1.0009 1.0300 1.0156 1.0166 0.9919 0.9883 1.0141 0.9900 0.9894 0.9877 1.0057 1.0030 1.0049 1.0027 1.0180 1.0096
dispcorr: -0.019691818 hartree
energy: -1994.788862485658
dipole: 7.48387 -9.30414 -1.82027 -6.35589 5.28605 -1.06985 18.51252 -16.24678 2.26574
magnitude: 3.09702 au
magnitude: 7.87200 debye
