program: Orca
programVersion: 5.0.4
elementType: S S P O O O N N N C C C C C C C C C C C C H H H H H H H H H H H H H H H H
charge: 0
multiplicity: 1
keywords: wb97x-d3
keywords: def2-TZVPP
keywords: def2/J RIJCOSX
keywords: DEFGRID2
keywords: scfconv7
keywords: smallprint printgap noloewdin
keywords: NOSOSCF
formula: C12H16N3O3PS2
InChI: InChI=1/C12H16N3O3PS2/c1-3-17-19(20,18-4-2)21-9-15-12(16)10-7-5-6-8-11(10)13-14-15/h5-8H,3-4,9H2,1-2H3
37 atoms
S  1.56913 1.611817 -1.446252
S  3.816775 0.419293 0.618459
P  2.125885 0.029581 -0.211614
O  2.007066 -1.218904 -1.189358
O  0.898339 -0.233297 0.785382
O  -1.167463 -1.385342 -1.497223
N  -1.068192 0.878499 -1.266136
N  -1.464487 2.045259 -0.726756
N  -2.326479 2.079499 0.169313
C  0.010875 1.035695 -2.210286
C  -2.541885 -0.335726 0.123203
C  -1.550977 -0.37894 -0.935492
C  -2.885822 0.909529 0.647358
C  -3.11612 -1.497293 0.638127
C  -3.805906 1.001884 1.693227
C  1.998823 -2.596158 -0.747442
C  0.688804 0.562764 1.967812
C  -4.022301 -1.399689 1.673119
C  -4.365072 -0.150559 2.20074
C  3.394941 -3.1518 -0.614322
C  -0.125681 -0.234941 2.952489
H  0.166371 0.106647 -2.748165
H  -0.246103 1.809831 -2.932044
H  -2.845263 -2.462708 0.232392
H  -4.059902 1.975611 2.090988
H  1.446239 -2.689909 0.188465
H  1.439992 -3.130128 -1.514255
H  1.653194 0.834294 2.402989
H  0.179557 1.485991 1.683761
H  -4.470187 -2.295383 2.082101
H  -5.07499 -0.08992 3.014908
H  3.952116 -2.66835 0.187237
H  3.328102 -4.215267 -0.380496
H  3.9575 -3.048895 -1.542417
H  0.399442 -1.139546 3.260407
H  -0.295334 0.371692 3.842623
H  -1.09928 -0.515919 2.551388
elementType: S P O N C H
totalener: -1994.76802964 hartree
nucrepener: 2335.78074579 hartree
electener: -4330.54877543 hartree
oneelecener: -7388.01709996 hartree
twoeener: 3057.46832454 hartree
cpcmener: -0.02878263 hartree
kineticenergy: 1989.06514930 hartree
xcener: -136.740407860556 hartree
chargesum: 0.0000000
charge: -0.139083 -0.433606 0.605904 -0.337927 -0.317014 -0.469539 0.085057 -0.107129 -0.144715 -0.048127 0.034764 0.280313 0.055831 -0.134558 -0.177305 0.044304 -0.003093 -0.108066 -0.101427 -0.243386 -0.227566 0.148595 0.165777 0.148698 0.145401 0.101905 0.103935 0.118731 0.111506 0.163402 0.162804 0.075768 0.095090 0.089493 0.095427 0.098336 0.061501
qa: -0.1391 -0.4336 0.6059 -0.3379 -0.3170 -0.4695 0.0851 -0.1071 -0.1447 -0.0481 0.0348 0.2803 0.0558 -0.1346 -0.1773 0.0443 -0.0031 -0.1081 -0.1014 -0.2434 -0.2276 0.1486 0.1658 0.1487 0.1454 0.1019 0.1039 0.1187 0.1115 0.1634 0.1628 0.0758 0.0951 0.0895 0.0954 0.0983 0.0615
va: 2.2900 2.0402 5.4511 2.0995 2.0619 2.0489 3.2229 2.8204 2.9803 3.9036 3.3965 4.2679 3.9704 3.9251 4.0071 3.8481 3.8217 3.9169 3.9235 3.9445 3.9337 1.0276 1.0012 1.0182 1.0169 1.0004 0.9914 1.0179 0.9915 0.9894 0.9879 1.0211 1.0088 1.0038 1.0090 1.0079 1.0138
dispcorr: -0.023051935 hartree
energy: -1994.791081571519
dipole: -3.55491 0.76097 -2.79394 -14.80384 13.48951 -1.31433 11.32776 -10.18904 1.13871
magnitude: 3.29093 au
magnitude: 8.36489 debye
