program: Orca
programVersion: 5.0.4
elementType: S S P O O O N N N C C C C C C C C C C C C H H H H H H H H H H H H H H H H
charge: 0
multiplicity: 1
keywords: wb97x-d3
keywords: def2-TZVPP
keywords: def2/J RIJCOSX
keywords: DEFGRID2
keywords: scfconv7
keywords: smallprint printgap noloewdin
keywords: NOSOSCF
formula: C12H16N3O3PS2
InChI: InChI=1/C12H16N3O3PS2/c1-3-17-19(20,18-4-2)21-9-15-12(16)10-7-5-6-8-11(10)13-14-15/h5-8H,3-4,9H2,1-2H3
37 atoms
S  1.625001 1.471449 -1.66522
S  3.75369 -0.706896 -0.47587
P  1.944151 -0.083856 -0.30233
O  0.780026 -1.152918 -0.542238
O  1.433842 0.430848 1.114328
O  -1.109919 2.105421 1.446689
N  -0.962382 1.391582 -0.712504
N  -1.383726 0.659962 -1.758802
N  -2.262729 -0.209002 -1.621779
C  0.11279 2.29488 -1.041642
C  -2.456231 0.285286 0.744559
C  -1.46878 1.335638 0.579071
C  -2.816447 -0.456305 -0.379427
C  -3.032538 0.007086 1.983592
C  -3.75772 -1.481849 -0.273338
C  0.772936 -1.957637 -1.739273
C  2.295256 1.175222 2.003559
C  -3.956747 -1.011494 2.08351
C  -4.318503 -1.754876 0.955352
C  -0.153746 -3.12562 -1.530095
C  2.81222 0.279253 3.09956
H  -0.190224 2.965864 -1.845255
H  0.352285 2.893412 -0.169725
H  -2.750983 0.581346 2.855923
H  -4.028461 -2.047736 -1.154986
H  0.449327 -1.341368 -2.580678
H  1.785894 -2.309548 -1.949343
H  3.117352 1.632577 1.448901
H  1.679421 1.978684 2.404308
H  -4.405655 -1.238338 3.041236
H  -5.04538 -2.550624 1.049762
H  -0.168018 -3.728418 -2.438569
H  0.182495 -3.762751 -0.712169
H  -1.176182 -2.808224 -1.327657
H  1.995265 -0.176526 3.659606
H  3.448617 -0.511798 2.703241
H  3.4062 0.870911 3.797165
elementType: S P O N C H
totalener: -1994.76727122 hartree
nucrepener: 2340.11166102 hartree
electener: -4334.87893224 hartree
oneelecener: -7397.12053928 hartree
twoeener: 3062.24160704 hartree
cpcmener: -0.02670071 hartree
kineticenergy: 1989.07650949 hartree
xcener: -136.741273515787 hartree
chargesum: -0.0000000
charge: -0.150427 -0.427245 0.602217 -0.327053 -0.327635 -0.472050 0.071708 -0.112883 -0.147466 -0.030864 0.037193 0.303681 0.055604 -0.136945 -0.177295 0.002708 0.045143 -0.122328 -0.092195 -0.234544 -0.229882 0.164133 0.143671 0.150324 0.146860 0.108857 0.115353 0.090367 0.098886 0.164706 0.162794 0.093662 0.090694 0.080204 0.090514 0.075784 0.093748
qa: -0.1504 -0.4272 0.6022 -0.3271 -0.3276 -0.4720 0.0717 -0.1129 -0.1475 -0.0309 0.0372 0.3037 0.0556 -0.1369 -0.1773 0.0027 0.0451 -0.1223 -0.0922 -0.2345 -0.2299 0.1641 0.1437 0.1503 0.1469 0.1089 0.1154 0.0904 0.0989 0.1647 0.1628 0.0937 0.0907 0.0802 0.0905 0.0758 0.0937
va: 2.2691 2.0406 5.4830 2.0942 2.1146 2.0474 3.2255 2.8215 2.9641 3.8967 3.5036 4.2281 3.9911 3.9496 3.9755 3.8213 3.8355 3.9297 3.9189 3.9602 3.9394 0.9993 1.0248 1.0165 1.0166 0.9961 1.0110 1.0098 1.0016 0.9890 0.9876 1.0074 1.0067 1.0014 1.0048 1.0191 1.0077
dispcorr: -0.022166728 hartree
energy: -1994.789437943850
dipole: -2.86485 0.69660 -2.16825 -9.17508 8.88046 -0.29462 9.24438 -8.45581 0.78857
magnitude: 2.32593 au
magnitude: 5.91205 debye
