program: Orca
programVersion: 5.0.4
elementType: S S P O O O N N N C C C C C C C C C C C C H H H H H H H H H H H H H H H H
charge: 0
multiplicity: 1
keywords: wb97x-d3
keywords: def2-TZVPP
keywords: def2/J RIJCOSX
keywords: DEFGRID2
keywords: scfconv7
keywords: smallprint printgap noloewdin
keywords: NOSOSCF
formula: C12H16N3O3PS2
InChI: InChI=1/C12H16N3O3PS2/c1-3-17-19(20,18-4-2)21-9-15-12(16)10-7-5-6-8-11(10)13-14-15/h5-8H,3-4,9H2,1-2H3
37 atoms
S  1.62452 1.460775 -1.713476
S  3.688054 0.789982 0.754337
P  1.949546 0.388477 0.042968
O  1.628862 -1.142614 -0.294188
O  0.683342 0.771178 0.933465
O  -1.206348 -1.60464 -1.633243
N  -0.993173 0.657537 -1.459442
N  -1.351564 1.858059 -0.969765
N  -2.190988 1.95406 -0.058088
C  0.092302 0.730707 -2.405762
C  -2.480719 -0.452717 -0.000623
C  -1.524846 -0.567645 -1.085927
C  -2.766844 0.821628 0.486715
C  -3.081482 -1.574321 0.569514
C  -3.654789 0.983611 1.551834
C  2.509492 -1.930488 -1.118284
C  0.657436 0.629968 2.370047
C  -3.955309 -1.408103 1.623785
C  -4.239403 -0.129737 2.11549
C  2.05809 -3.366312 -1.056654
C  0.386708 -0.78871 2.803584
H  0.288218 -0.25936 -2.802812
H  -0.172449 1.387798 -3.233963
H  -2.858241 -2.562449 0.190023
H  -3.867409 1.979226 1.918782
H  2.476488 -1.552606 -2.143461
H  3.53481 -1.828916 -0.755189
H  1.596675 0.999322 2.787262
H  -0.137797 1.297963 2.697254
H  -4.424845 -2.272017 2.074789
H  -4.92571 -0.015367 2.944158
H  1.043671 -3.48839 -1.436049
H  2.721006 -3.973694 -1.673541
H  2.100476 -3.754817 -0.038673
H  1.215298 -1.457343 2.56829
H  0.248691 -0.804753 3.885634
H  -0.522297 -1.182228 2.346962
elementType: S P O N C H
totalener: -1994.76687561 hartree
nucrepener: 2352.61899231 hartree
electener: -4347.38586792 hartree
oneelecener: -7422.03572712 hartree
twoeener: 3074.64985920 hartree
cpcmener: -0.02912527 hartree
kineticenergy: 1989.07180508 hartree
xcener: -136.739228422908 hartree
chargesum: 0.0000000
charge: -0.141480 -0.431131 0.599439 -0.308168 -0.327545 -0.474211 0.064236 -0.097679 -0.138458 -0.039780 0.002964 0.312641 0.066741 -0.136637 -0.186634 0.018114 0.016093 -0.113163 -0.097975 -0.242569 -0.234347 0.144242 0.164251 0.149498 0.145589 0.102190 0.107424 0.106334 0.105243 0.163494 0.162843 0.086843 0.092451 0.088385 0.084556 0.103264 0.082939
qa: -0.1415 -0.4311 0.5994 -0.3082 -0.3275 -0.4742 0.0642 -0.0977 -0.1385 -0.0398 0.0030 0.3126 0.0667 -0.1366 -0.1866 0.0181 0.0161 -0.1132 -0.0980 -0.2426 -0.2343 0.1442 0.1643 0.1495 0.1456 0.1022 0.1074 0.1063 0.1052 0.1635 0.1628 0.0868 0.0925 0.0884 0.0846 0.1033 0.0829
va: 2.2801 2.0494 5.4549 2.0786 2.1004 2.0419 3.2385 2.8288 2.9917 3.9150 3.4310 4.2315 3.9728 3.9147 4.0040 3.8400 3.8520 3.9240 3.9202 3.9594 3.9056 1.0218 1.0005 1.0177 1.0170 0.9900 1.0088 1.0136 0.9911 0.9890 0.9875 1.0100 1.0071 1.0037 1.0176 1.0099 1.0010
dispcorr: -0.023056299 hartree
energy: -1994.789931911506
dipole: -3.11578 0.97627 -2.13951 -17.34883 15.82857 -1.52025 8.73198 -8.01536 0.71662
magnitude: 2.72071 au
magnitude: 6.91548 debye
