program: Orca
programVersion: 5.0.4
elementType: S S P O O O N N N C C C C C C C C C C C C H H H H H H H H H H H H H H H H
charge: 0
multiplicity: 1
keywords: wb97x-d3
keywords: def2-TZVPP
keywords: def2/J RIJCOSX
keywords: DEFGRID2
keywords: scfconv7
keywords: smallprint printgap noloewdin
keywords: NOSOSCF
formula: C12H16N3O3PS2
InChI: InChI=1/C12H16N3O3PS2/c1-3-17-19(20,18-4-2)21-9-15-12(16)10-7-5-6-8-11(10)13-14-15/h5-8H,3-4,9H2,1-2H3
37 atoms
S  1.561418 1.722427 -1.358019
S  3.910751 0.504888 0.595155
P  2.221045 0.100495 -0.22799
O  2.159534 -1.103416 -1.267454
O  1.02717 -0.277294 0.774301
O  -1.0431 -1.358383 -1.499518
N  -1.05642 0.901297 -1.231745
N  -1.520491 2.040806 -0.689037
N  -2.412056 2.023062 0.178131
C  0.028781 1.120987 -2.155221
C  -2.521967 -0.399045 0.086723
C  -1.492805 -0.381665 -0.93552
C  -2.937939 0.821814 0.616589
C  -3.063507 -1.592416 0.563342
C  -3.898664 0.858253 1.628684
C  2.752161 -2.396039 -0.996518
C  0.738535 0.527639 1.933978
C  -4.008914 -1.550038 1.56649
C  -4.424437 -0.325327 2.099146
C  1.841563 -3.29831 -0.200964
C  -0.10147 -0.280633 2.887569
H  0.217609 0.217647 -2.725456
H  -0.243446 1.912941 -2.851461
H  -2.737249 -2.539663 0.155712
H  -4.209998 1.813141 2.03125
H  2.953035 -2.818031 -1.979847
H  3.710235 -2.255983 -0.491159
H  1.673795 0.829813 2.411078
H  0.217213 1.433786 1.616884
H  -4.430992 -2.470226 1.947484
H  -5.164614 -0.308426 2.888103
H  0.870203 -3.416297 -0.680409
H  2.302474 -4.285043 -0.137526
H  1.689113 -2.942494 0.817355
H  -0.329302 0.330324 3.761529
H  -1.047139 -0.58951 2.442943
H  0.429043 -1.169541 3.230039
elementType: S P O N C H
totalener: -1994.76906521 hartree
nucrepener: 2336.72774107 hartree
electener: -4331.49680628 hartree
oneelecener: -7390.08446062 hartree
twoeener: 3058.58765434 hartree
cpcmener: -0.02937793 hartree
kineticenergy: 1989.06512258 hartree
xcener: -136.738714724770 hartree
chargesum: -0.0000000
charge: -0.139755 -0.434596 0.607132 -0.331009 -0.314432 -0.468465 0.088401 -0.107620 -0.142100 -0.053934 0.037404 0.277050 0.049892 -0.133435 -0.173006 0.038363 -0.001768 -0.108351 -0.103834 -0.247240 -0.234153 0.150797 0.166661 0.149529 0.145137 0.108023 0.087037 0.118737 0.109279 0.163780 0.162770 0.088170 0.102709 0.080566 0.100175 0.065234 0.096852
qa: -0.1398 -0.4346 0.6071 -0.3310 -0.3144 -0.4685 0.0884 -0.1076 -0.1421 -0.0539 0.0374 0.2771 0.0499 -0.1334 -0.1730 0.0384 -0.0018 -0.1084 -0.1038 -0.2472 -0.2342 0.1508 0.1667 0.1495 0.1451 0.1080 0.0870 0.1187 0.1093 0.1638 0.1628 0.0882 0.1027 0.0806 0.1002 0.0652 0.0969
va: 2.2843 2.0441 5.4497 2.1077 2.0592 2.0469 3.2229 2.8221 2.9839 3.9039 3.3897 4.2607 3.9813 3.9203 4.0061 3.8647 3.8214 3.9182 3.9266 3.9149 3.9366 1.0262 1.0013 1.0157 1.0168 0.9897 1.0134 1.0164 0.9929 0.9890 0.9878 1.0119 1.0102 1.0128 1.0078 1.0130 1.0077
dispcorr: -0.023156313 hartree
energy: -1994.792221526561
dipole: -5.95507 3.35729 -2.59778 -15.46258 14.12572 -1.33686 11.44813 -10.48160 0.96654
magnitude: 3.07731 au
magnitude: 7.82191 debye
