program: Orca
programVersion: 5.0.4
elementType: S S P O O O N N N C C C C C C C C C C C C H H H H H H H H H H H H H H H H
charge: 0
multiplicity: 1
keywords: wb97x-d3
keywords: def2-TZVPP
keywords: def2/J RIJCOSX
keywords: DEFGRID2
keywords: scfconv7
keywords: smallprint printgap noloewdin
keywords: NOSOSCF
formula: C12H16N3O3PS2
InChI: InChI=1/C12H16N3O3PS2/c1-3-17-19(20,18-4-2)21-9-15-12(16)10-7-5-6-8-11(10)13-14-15/h5-8H,3-4,9H2,1-2H3
37 atoms
S  1.324201 2.204234 -1.239149
S  3.398316 -0.336432 -1.587204
P  1.745648 0.21447 -0.775305
O  0.417818 -0.537713 -1.240066
O  1.615183 0.089885 0.811901
O  -0.831074 1.301851 2.230183
N  -1.07435 1.677954 -0.005119
N  -1.696204 1.49682 -1.184859
N  -2.5465 0.602261 -1.3304
C  -0.012476 2.650421 -0.065769
C  -2.302295 -0.077064 0.984723
C  -1.349976 1.000799 1.173979
C  -2.857527 -0.24441 -0.282827
C  -2.635348 -0.950407 2.019388
C  -3.752038 -1.288525 -0.525148
C  0.377489 -1.948896 -1.539659
C  2.679628 0.467922 1.708255
C  -3.513713 -1.984164 1.771916
C  -4.070564 -2.152698 0.499971
C  0.320384 -2.804786 -0.299143
C  3.330087 -0.763314 2.285128
H  -0.391454 3.605044 -0.430249
H  0.394768 2.799108 0.928232
H  -2.201787 -0.819673 3.001788
H  -4.176851 -1.404932 -1.513478
H  -0.520063 -2.076061 -2.142781
H  1.236945 -2.210738 -2.160914
H  3.413128 1.094291 1.19515
H  2.215673 1.071674 2.487795
H  -3.774811 -2.670332 2.566334
H  -4.758218 -2.968397 0.320698
H  0.165378 -3.842708 -0.597756
H  1.24735 -2.763087 0.273844
H  -0.507191 -2.51785 0.351128
H  4.082023 -0.465162 3.016855
H  2.602698 -1.395836 2.795052
H  3.826113 -1.35193 1.51327
elementType: S P O N C H
totalener: -1994.76514930 hartree
nucrepener: 2363.40732099 hartree
electener: -4358.17247029 hartree
oneelecener: -7443.61113987 hartree
twoeener: 3085.43866959 hartree
cpcmener: -0.02842986 hartree
kineticenergy: 1989.07746989 hartree
xcener: -136.741226766058 hartree
chargesum: 0.0000000
charge: -0.142959 -0.430639 0.596507 -0.329018 -0.313174 -0.470776 0.059159 -0.093923 -0.142648 -0.032961 0.013171 0.306118 0.056201 -0.130423 -0.180610 0.016362 0.041835 -0.116268 -0.100263 -0.233169 -0.239603 0.162559 0.143795 0.148383 0.145252 0.106208 0.108760 0.092707 0.098079 0.164338 0.162530 0.105057 0.083522 0.077918 0.098838 0.091035 0.078101
qa: -0.1430 -0.4306 0.5965 -0.3290 -0.3132 -0.4708 0.0592 -0.0939 -0.1426 -0.0330 0.0132 0.3061 0.0562 -0.1304 -0.1806 0.0164 0.0418 -0.1163 -0.1003 -0.2332 -0.2396 0.1626 0.1438 0.1484 0.1453 0.1062 0.1088 0.0927 0.0981 0.1643 0.1625 0.1051 0.0835 0.0779 0.0988 0.0910 0.0781
va: 2.2775 2.0394 5.4587 2.0955 2.0738 2.0491 3.2309 2.8349 2.9909 3.9141 3.4423 4.2407 3.9734 3.9209 3.9974 3.8456 3.8374 3.9228 3.9187 3.9112 3.9343 0.9998 1.0228 1.0183 1.0169 0.9921 1.0124 1.0104 1.0002 0.9890 0.9877 1.0107 1.0127 1.0023 1.0102 1.0027 1.0169
dispcorr: -0.023608386 hartree
energy: -1994.788757683023
dipole: 1.47973 -3.17768 -1.69795 -15.95512 14.59429 -1.36083 12.35134 -10.74870 1.60264
magnitude: 2.70247 au
magnitude: 6.86913 debye
